BDBM280355 4-[[2-(5-chloro-2-fluoro-phenyl)-5-isopropyl-4-pyridyl]amino]-N-[2-hydroxy-1-(hydroxymethyl)ethyl]pyridine-3-carboxamide::US10030004, Compound 22::US10501436, Compound 22::US11053216, Compound 22::US11702401, Compound 22
SMILES CC(C)c1cnc(cc1Nc1ccncc1C(=O)NC(CO)CO)-c1cc(Cl)ccc1F
InChI Key InChIKey=IPBLCOKXDQHSQW-UHFFFAOYSA-N
Data  30 IC50
  Tab Delimited (TSV)   2D SDfile   Computed 3D by Vconf -m prep SDfile
Find this compound or compounds like it in BindingDB:
Activity Spreadsheet -- Enzyme Inhibition Constant Data from BindingDB
Found 30 hits for monomerid = 280355
TargetSerine/threonine-protein kinase receptor R3(Homo sapiens (Human))
Medivation Technologies
US Patent
LigandPNGBDBM280355(4-[[2-(5-chloro-2-fluoro-phenyl)-5-isopropyl-4-pyr...)
Affinity DataIC50:  7.29E+3nM. Assay description: Compound of the invention were screened in an in vitro kinase assay against several members of the TGFβ family of Ser/Thr kinases. The kinases t...
In DepthDetails US Patent
TargetTGF-beta receptor type-1(Homo sapiens (Human))TBA
LigandPNGBDBM280355(4-[[2-(5-chloro-2-fluoro-phenyl)-5-isopropyl-4-pyr...)
Affinity DataIC50:  24nM. Assay description: Inhibitory activity against Escherichia coli leader peptidase using substrate A
In DepthDetails PubMed
TargetBone morphogenetic protein receptor type-1A(Homo sapiens (Human))
Medivation Technologies
US Patent
LigandPNGBDBM280355(4-[[2-(5-chloro-2-fluoro-phenyl)-5-isopropyl-4-pyr...)
Affinity DataIC50: >1.00E+6nM. Assay description: Compound of the invention were screened in an in vitro kinase assay against several members of the TGFβ family of Ser/Thr kinases. The kinases t...
In DepthDetails US Patent
TargetActivin receptor type-1B(Homo sapiens (Human))
Medivation Technologies
US Patent
LigandPNGBDBM280355(4-[[2-(5-chloro-2-fluoro-phenyl)-5-isopropyl-4-pyr...)
Affinity DataIC50:  56.7nM. Assay description: Compound of the invention were screened in an in vitro kinase assay against several members of the TGFβ family of Ser/Thr kinases. The kinases t...
In DepthDetails US Patent
TargetTGF-beta receptor type-1(Homo sapiens (Human))TBA
LigandPNGBDBM280355(4-[[2-(5-chloro-2-fluoro-phenyl)-5-isopropyl-4-pyr...)
Affinity DataIC50:  24.7nM. Assay description: Compound of the invention were screened in an in vitro kinase assay against several members of the TGFβ family of Ser/Thr kinases. The kinases t...
In DepthDetails US Patent
TargetBone morphogenetic protein receptor type-1B(Mus musculus (Mouse))
Medivation Technologies
US Patent
LigandPNGBDBM280355(4-[[2-(5-chloro-2-fluoro-phenyl)-5-isopropyl-4-pyr...)
Affinity DataIC50: >1.00E+6nM. Assay description: Compound of the invention were screened in an in vitro kinase assay against several members of the TGFβ family of Ser/Thr kinases. The kinases t...
In DepthDetails US Patent
TargetSerine/threonine-protein kinase receptor R3(Homo sapiens (Human))
Medivation Technologies
US Patent
LigandPNGBDBM280355(4-[[2-(5-chloro-2-fluoro-phenyl)-5-isopropyl-4-pyr...)
Affinity DataIC50:  7.29E+3nM. Assay description: Compound of the invention were screened in an in vitro kinase assay against several members of the TGFβ family of Ser/Thr kinases. The kinases t...
In DepthDetails US Patent
TargetActivin receptor type-1(Homo sapiens (Human))
Medivation Technologies
US Patent
LigandPNGBDBM280355(4-[[2-(5-chloro-2-fluoro-phenyl)-5-isopropyl-4-pyr...)
Affinity DataIC50: >1.00E+6nM. Assay description: Compound of the invention were screened in an in vitro kinase assay against several members of the TGFβ family of Ser/Thr kinases. The kinases t...
In DepthDetails US Patent
TargetBone morphogenetic protein receptor type-1A(Homo sapiens (Human))
Medivation Technologies
US Patent
LigandPNGBDBM280355(4-[[2-(5-chloro-2-fluoro-phenyl)-5-isopropyl-4-pyr...)
Affinity DataIC50: >1.00E+6nM. Assay description: Compound of the invention were screened in an in vitro kinase assay against several members of the TGFβ family of Ser/Thr kinases. The kinases t...
In DepthDetails US Patent
TargetActivin receptor type-1B(Homo sapiens (Human))
Medivation Technologies
US Patent
LigandPNGBDBM280355(4-[[2-(5-chloro-2-fluoro-phenyl)-5-isopropyl-4-pyr...)
Affinity DataIC50:  56.7nM. Assay description: Compound of the invention were screened in an in vitro kinase assay against several members of the TGFβ family of Ser/Thr kinases. The kinases t...
In DepthDetails US Patent
TargetTGF-beta receptor type-1(Homo sapiens (Human))TBA
LigandPNGBDBM280355(4-[[2-(5-chloro-2-fluoro-phenyl)-5-isopropyl-4-pyr...)
Affinity DataIC50:  24.7nM. Assay description: Compound of the invention were screened in an in vitro kinase assay against several members of the TGFβ family of Ser/Thr kinases. The kinases t...
In DepthDetails US Patent
TargetBone morphogenetic protein receptor type-1B(Homo sapiens (Human))
Medivation Technologies
US Patent
LigandPNGBDBM280355(4-[[2-(5-chloro-2-fluoro-phenyl)-5-isopropyl-4-pyr...)
Affinity DataIC50: >1.00E+6nM. Assay description: Compound of the invention were screened in an in vitro kinase assay against several members of the TGFβ family of Ser/Thr kinases. The kinases t...
In DepthDetails US Patent
TargetSerine/threonine-protein kinase receptor R3(Homo sapiens (Human))
Medivation Technologies
US Patent
LigandPNGBDBM280355(4-[[2-(5-chloro-2-fluoro-phenyl)-5-isopropyl-4-pyr...)
Affinity DataIC50:  7.29E+3nM. Assay description: Compound of the invention were screened in an in vitro kinase assay against several members of the TGFβ family of Ser/Thr kinases. The kinases t...
In DepthDetails US Patent
TargetActivin receptor type-1(Homo sapiens (Human))
Medivation Technologies
US Patent
LigandPNGBDBM280355(4-[[2-(5-chloro-2-fluoro-phenyl)-5-isopropyl-4-pyr...)
Affinity DataIC50: >1.00E+6nM
In DepthDetails US Patent
TargetBone morphogenetic protein receptor type-1A(Homo sapiens (Human))
Medivation Technologies
US Patent
LigandPNGBDBM280355(4-[[2-(5-chloro-2-fluoro-phenyl)-5-isopropyl-4-pyr...)
Affinity DataIC50: >1.00E+6nM
In DepthDetails US Patent
TargetActivin receptor type-1B(Homo sapiens (Human))
Medivation Technologies
US Patent
LigandPNGBDBM280355(4-[[2-(5-chloro-2-fluoro-phenyl)-5-isopropyl-4-pyr...)
Affinity DataIC50:  56.7nM
In DepthDetails US Patent
TargetTGF-beta receptor type-1(Homo sapiens (Human))TBA
LigandPNGBDBM280355(4-[[2-(5-chloro-2-fluoro-phenyl)-5-isopropyl-4-pyr...)
Affinity DataIC50:  24.7nM
In DepthDetails US Patent
TargetBone morphogenetic protein 10(Homo sapiens (Human))
Medivation Technologies
US Patent
LigandPNGBDBM280355(4-[[2-(5-chloro-2-fluoro-phenyl)-5-isopropyl-4-pyr...)
Affinity DataIC50: >1.00E+6nM
In DepthDetails US Patent
TargetSerine/threonine-protein kinase receptor R3(Homo sapiens (Human))
Medivation Technologies
US Patent
LigandPNGBDBM280355(4-[[2-(5-chloro-2-fluoro-phenyl)-5-isopropyl-4-pyr...)
Affinity DataIC50:  7.29E+3nM. Assay description: Compound of the invention were screened in an in vitro kinase assay against several members of the TGFβ3 family of Ser/Thr kinases. The kinases ...
In DepthDetails US Patent
TargetActivin receptor type-1(Homo sapiens (Human))
Medivation Technologies
US Patent
LigandPNGBDBM280355(4-[[2-(5-chloro-2-fluoro-phenyl)-5-isopropyl-4-pyr...)
Affinity DataIC50: >1.00E+6nM. Assay description: Compound of the invention were screened in an in vitro kinase assay against several members of the TGFβ3 family of Ser/Thr kinases. The kinases ...
In DepthDetails US Patent
TargetBone morphogenetic protein receptor type-1A(Homo sapiens (Human))
Medivation Technologies
US Patent
LigandPNGBDBM280355(4-[[2-(5-chloro-2-fluoro-phenyl)-5-isopropyl-4-pyr...)
Affinity DataIC50: >1.00E+6nM. Assay description: Compound of the invention were screened in an in vitro kinase assay against several members of the TGFβ3 family of Ser/Thr kinases. The kinases ...
In DepthDetails US Patent
TargetActivin receptor type-1B(Homo sapiens (Human))
Medivation Technologies
US Patent
LigandPNGBDBM280355(4-[[2-(5-chloro-2-fluoro-phenyl)-5-isopropyl-4-pyr...)
Affinity DataIC50:  56.7nM. Assay description: Compound of the invention were screened in an in vitro kinase assay against several members of the TGFβ3 family of Ser/Thr kinases. The kinases ...
In DepthDetails US Patent
TargetTGF-beta receptor type-1(Homo sapiens (Human))TBA
LigandPNGBDBM280355(4-[[2-(5-chloro-2-fluoro-phenyl)-5-isopropyl-4-pyr...)
Affinity DataIC50:  24.7nM. Assay description: Compound of the invention were screened in an in vitro kinase assay against several members of the TGFβ3 family of Ser/Thr kinases. The kinases ...
In DepthDetails US Patent
TargetBone morphogenetic protein receptor type-1B(Homo sapiens (Human))
Medivation Technologies
US Patent
LigandPNGBDBM280355(4-[[2-(5-chloro-2-fluoro-phenyl)-5-isopropyl-4-pyr...)
Affinity DataIC50: >1.00E+6nM. Assay description: Compound of the invention were screened in an in vitro kinase assay against several members of the TGFβ3 family of Ser/Thr kinases. The kinases ...
In DepthDetails US Patent
TargetBone morphogenetic protein receptor type-1B(Homo sapiens (Human))
Medivation Technologies
US Patent
LigandPNGBDBM280355(4-[[2-(5-chloro-2-fluoro-phenyl)-5-isopropyl-4-pyr...)
Affinity DataIC50: >1.00E+6nM. Assay description: Antagonist effect against bradykinin B2 receptor was determined in rabbit jugular vein
In DepthDetails PubMed
TargetBone morphogenetic protein receptor type-1A(Homo sapiens (Human))
Medivation Technologies
US Patent
LigandPNGBDBM280355(4-[[2-(5-chloro-2-fluoro-phenyl)-5-isopropyl-4-pyr...)
Affinity DataIC50: >1.00E+6nM. Assay description: pA2 for inhibition of NPY-stimulated [Ca2+] mobilization in HEL cells
In DepthDetails PubMed
TargetActivin receptor type-1B(Homo sapiens (Human))
Medivation Technologies
US Patent
LigandPNGBDBM280355(4-[[2-(5-chloro-2-fluoro-phenyl)-5-isopropyl-4-pyr...)
Affinity DataIC50:  57nM. Assay description: Inhibitory activity against Escherichia coli leader peptidase using substrate A
In DepthDetails PubMed
TargetActivin receptor type-1(Homo sapiens (Human))
Medivation Technologies
US Patent
LigandPNGBDBM280355(4-[[2-(5-chloro-2-fluoro-phenyl)-5-isopropyl-4-pyr...)
Affinity DataIC50: >1.00E+6nM. Assay description: Inhibitory activity against Escherichia coli leader peptidase using substrate A
In DepthDetails PubMed
TargetSerine/threonine-protein kinase receptor R3(Homo sapiens (Human))
Medivation Technologies
US Patent
LigandPNGBDBM280355(4-[[2-(5-chloro-2-fluoro-phenyl)-5-isopropyl-4-pyr...)
Affinity DataIC50:  7.29E+3nM. Assay description: Inhibitory activity against Escherichia coli leader peptidase using substrate A
In DepthDetails PubMed
TargetActivin receptor type-1(Homo sapiens (Human))
Medivation Technologies
US Patent
LigandPNGBDBM280355(4-[[2-(5-chloro-2-fluoro-phenyl)-5-isopropyl-4-pyr...)
Affinity DataIC50: >1.00E+6nM. Assay description: Compound of the invention were screened in an in vitro kinase assay against several members of the TGFβ family of Ser/Thr kinases. The kinases t...
In DepthDetails US Patent