BDBM28431 (2R,3R,4S,5R)-2-(6-amino-9H-purin-9-yl)-5-({[2-(aminooxy)ethyl](methyl)amino}methyl)oxolane-3,4-diol::MAOEA, 5
SMILES CN(CCON)C[C@H]1O[C@H]([C@H](O)[C@@H]1O)n1cnc2c(N)ncnc12
InChI Key InChIKey=PPIPUCUVJJZYEK-QYVSTXNMSA-N
Data  1 IC50
PDB links: 1 PDB ID matches this monomer.
  Tab Delimited (TSV)   2D SDfile   Computed 3D by Vconf -m prep SDfile
Find this compound or compounds like it in BindingDB:
Activity Spreadsheet -- Enzyme Inhibition Constant Data from BindingDB
Found 1 hit for monomerid = 28431
TargetS-adenosylmethionine decarboxylase proenzyme(Homo sapiens (Human))
Cornell University
LigandPNGBDBM28431((2R,3R,4S,5R)-2-(6-amino-9H-purin-9-yl)-5-({[2-(am...)
Affinity DataIC50:  55nMpH: 6.8 T: 2°C. Assay description: The C-terminal his-tagged AdoMetDC was assayed by measuring the release of 14CO2 from S-adenosyl-L-[carboxy-14C]methionine (Amersham Pharmacia Biotec...