BDBM32646 amino pyrimidine, 6a
SMILES Nc1nc(cs1)-c1ccnc(N)n1
InChI Key InChIKey=FHERIFNAOMUFRM-UHFFFAOYSA-N
Data  1 IC50
PDB links: 1 PDB ID matches this monomer.
  Tab Delimited (TSV)   2D SDfile   Computed 3D by Vconf -m prep SDfile
Find this compound or compounds like it in BindingDB:
Activity Spreadsheet -- Enzyme Inhibition Constant Data from BindingDB
Found 1 hit for monomerid = 32646
TargetBiotin carboxylase(Escherichia coli (strain K12))
Pfizer
LigandPNGBDBM32646(amino pyrimidine, 6a)
Affinity DataIC50:  1.20E+4nMpH: 8.0 T: 2°C. Assay description: Assays were performed in 384-well clear bottom plates (Corning; catalog no. 3702), that contained inhibitor solvated in DMSO. To each well of the pla...