BDBM35420 MLS000096728::N-(1-benzyl-3,5-dimethyl-1H-pyrazol-4-yl)-2-[(3-methyl-4-oxo-3,5,6,7-tetrahydro-4H-cyclopenta[4,5]thieno[2,3-d]pyrimidin-2-yl)thio]acetamide::N-(1-benzyl-3,5-dimethyl-pyrazol-4-yl)-2-[(1-keto-2-methyl-7,8-dihydro-6H-cyclopenta[2,3]thieno[2,4-b]pyrimidin-3-yl)thio]acetamide::N-(1-benzyl-3,5-dimethylpyrazol-4-yl)-2-[(2-methyl-1-oxo-7,8-dihydro-6H-cyclopenta[2,3]thieno[2,4-b]pyrimidin-3-yl)sulfanyl]acetamide::N-[3,5-dimethyl-1-(phenylmethyl)-4-pyrazolyl]-2-[(2-methyl-1-oxo-7,8-dihydro-6H-cyclopenta[2,3]thieno[2,4-b]pyrimidin-3-yl)thio]acetamide::N-[3,5-dimethyl-1-(phenylmethyl)pyrazol-4-yl]-2-[(2-methyl-1-oxidanylidene-7,8-dihydro-6H-cyclopenta[2,3]thieno[2,4-b]pyrimidin-3-yl)sulfanyl]ethanamide::SMR000074001::cid_990847
SMILES Cc1nn(Cc2ccccc2)c(C)c1NC(=O)CSc1nc2sc3CCCc3c2c(=O)n1C
InChI Key InChIKey=FBPSPDWXYZYPNK-UHFFFAOYSA-N
Data  2 IC50
  Tab Delimited (TSV)   2D SDfile   Computed 3D by Vconf -m prep SDfile
Find this compound or compounds like it in BindingDB:
Activity Spreadsheet -- Enzyme Inhibition Constant Data from BindingDB
Found 2 hits for monomerid = 35420
TargetDual specificity protein phosphatase 6(Rattus norvegicus)
University of Pittsburgh
Curated by PubChem BioAssay
LigandPNGBDBM35420(MLS000096728 | N-(1-benzyl-3,5-dimethyl-1H-pyrazol...)
Affinity DataIC50: >5.00E+4nM. Assay description: The in vitro MKP-3 Phosphatase dose response hit/probe assessment assay has been developed and run at the University of Pittsburgh Molecular Screenin...
In DepthDetails PCBioAssay
TargetDual specificity protein phosphatase 1(Homo sapiens (Human))
University of Pittsburgh
Curated by PubChem BioAssay
LigandPNGBDBM35420(MLS000096728 | N-(1-benzyl-3,5-dimethyl-1H-pyrazol...)
Affinity DataIC50: >5.00E+4nMpH: 7.0 T: 2°C. Assay description: The MKP-1 HTS confirmation dose response assay has been developed to confirm actives identified in the MH-76391 In vitro HTS assay for MKP-1 inhibito...
In DepthDetails PCBioAssay