BDBM36385 (3S,4R,5R)-3,4-Dihydroxy-5-(hydroxymethyl)piperidin-2-one, 6::CID448980
SMILES OC[C@H]1CNC(=O)[C@@H](O)[C@@H]1O
InChI Key InChIKey=ARBXEMIAJIJEQI-WDCZJNDASA-N
Data  1 KI
PDB links: 5 PDB IDs match this monomer.
  Tab Delimited (TSV)   2D SDfile   Computed 3D by Vconf -m prep SDfile
Find this compound or compounds like it in BindingDB:
Activity Spreadsheet -- Enzyme Inhibition Constant Data from BindingDB
Found 1 hit for monomerid = 36385
TargetBeta-mannosidase(Bacteroides thetaiotaomicron)
The Medical School, Newcastle University
LigandPNGBDBM36385((3S,4R,5R)-3,4-Dihydroxy-5-(hydroxymethyl)piperidi...)
Affinity DataKi:  1.10E+4nM ΔG°:  -7.03kcal/molepH: 5.6 T: 2°C. Assay description: Putative mannosidase assay using wild-type protein Btman2A. Enzyme inhibition assay.