BDBM374776 US10246467, Example I-76::US10919913, # I-76
SMILES OC(=O)c1ccc2c3OC[C@H]4[C@H]([C@H](c5ccc(F)c(Cl)c5F)[C@@]5(N4CC4CC4)C(=O)Nc4cc(Cl)ccc54)n3nc2c1
InChI Key InChIKey=JLAUWTQRXSHDPG-MCFYFMLRSA-N
Data  2 IC50
  Tab Delimited (TSV)   2D SDfile   Computed 3D by Vconf -m prep SDfile
Find this compound or compounds like it in BindingDB:
Activity Spreadsheet -- Enzyme Inhibition Constant Data from BindingDB
Found 2 hits for monomerid = 374776
TargetE3 ubiquitin-protein ligase Mdm2(Homo sapiens (Human))
Boehringer Ingelheim International
US Patent
LigandPNGBDBM374776(US10246467, Example I-76 | US10919913, # I-76)
Affinity DataIC50:  13nM. Assay description: This assay is used to determine whether the compounds inhibit the p53-MDM2 interaction and thus restore p53 function.15 μL of compound in 20% DM...
Ligand InfoPC cidPC sid
In DepthDetails US Patent
TargetCellular tumor antigen p53 [16-27]/E3 ubiquitin-protein ligase Mdm2 [23-117](Homo sapiens (Human))
Boehringer Ingelheim International
US Patent
LigandPNGBDBM374776(US10246467, Example I-76 | US10919913, # I-76)
Affinity DataIC50:  13nM. Assay description: This assay is used to determine whether the compounds inhibit the p53-MDM2 interaction and thus restore p53 function.15 μL of compound in 20% DM...
Ligand InfoPC cidPC sid
In DepthDetails US Patent