BDBM37530 4-Chloro-N-(5-methyl-isoxazol-3-yl)-benzamide::4-chloranyl-N-(5-methyl-1,2-oxazol-3-yl)benzamide::4-chloro-N-(5-methyl-1,2-oxazol-3-yl)benzamide::4-chloro-N-(5-methyl-3-isoxazolyl)benzamide::4-chloro-N-(5-methylisoxazol-3-yl)benzamide::MLS000034567::SMR000011786::cid_652109
SMILES Cc1cc(NC(=O)c2ccc(Cl)cc2)no1
InChI Key InChIKey=CVDHQYKCNQTJJO-UHFFFAOYSA-N
Data  2 IC50
  Tab Delimited (TSV)   2D SDfile   Computed 3D by Vconf -m prep SDfile
Find this compound or compounds like it in BindingDB:
Activity Spreadsheet -- Enzyme Inhibition Constant Data from BindingDB
Found 2 hits for monomerid = 37530
TargetNeutrophil cytosol factor 1 [S99G](Homo sapiens (Human))
Emory University
Curated by PubChem BioAssay
LigandPNGBDBM37530(4-Chloro-N-(5-methyl-isoxazol-3-yl)-benzamide | 4-...)
Affinity DataIC50:  5.00E+4nM. Assay description: NIH Molecular Libraries Screening Centers Network [MLSCN] Emory Chemical Biology Discovery Center in MLSCN Assay provider: Susan Smith, Emory Univers...
In DepthDetails PCBioAssay
TargetHuntingtin(Homo sapiens (Human))
Columbia University Molecular Screening Center
Curated by PubChem BioAssay
LigandPNGBDBM37530(4-Chloro-N-(5-methyl-isoxazol-3-yl)-benzamide | 4-...)
Affinity DataIC50: >8.00E+3nM. Assay description: The mutation underlying Huntington's disease is an expansion of a polyglutamine tract in the N-terminus of the protein huntingtin (htt). Under no...
In DepthDetails PCBioAssay