BDBM37880 3-(2-furanylmethyl)-8-methoxy-5H-pyrimido[5,4-b]indol-4-one::3-(2-furfuryl)-8-methoxy-5H-pyrimid[5,4-b]indol-4-one::3-(furan-2-ylmethyl)-8-methoxy-5H-pyrimido[5,4-b]indol-4-one::MLS000078427::SMR000039440::cid_658506
SMILES COc1ccc2[nH]c3c(ncn(Cc4ccco4)c3=O)c2c1
InChI Key InChIKey=KJVGEBMPIFPOHG-UHFFFAOYSA-N
Data  2 IC50
  Tab Delimited (TSV)   2D SDfile   Computed 3D by Vconf -m prep SDfile
Find this compound or compounds like it in BindingDB:
Activity Spreadsheet -- Enzyme Inhibition Constant Data from BindingDB
Found 2 hits for monomerid = 37880
TargetRho-associated protein kinase 2(Homo sapiens (Human))
The Scripps Research Institute Molecular Screening Center
Curated by PubChem BioAssay
LigandPNGBDBM37880(3-(2-furanylmethyl)-8-methoxy-5H-pyrimido[5,4-b]in...)
Affinity DataIC50:  464nM. Assay description: Source (MLSCN Center Name): The Scripps Research Institute Molecular Screening Center Center Affiliation: The Scripps Research Institute, TSRI Assay ...
In DepthDetails PCBioAssay
TargetcAMP-dependent protein kinase catalytic subunit alpha(Homo sapiens (Human))
The Scripps Research Institute Molecular Screening Center
Curated by PubChem BioAssay
LigandPNGBDBM37880(3-(2-furanylmethyl)-8-methoxy-5H-pyrimido[5,4-b]in...)
Affinity DataIC50:  1.79E+4nM. Assay description: Source (MLSCN Center Name): The Scripps Research Institute Molecular Screening Center Center Affiliation: The Scripps Research Institute, TSRI Assay ...
In DepthDetails PCBioAssay