BDBM39308 MLS000109378::N-(4-pyridyl)coumarilamide::N-pyridin-4-yl-1-benzofuran-2-carboxamide::N-pyridin-4-yl-2-benzofurancarboxamide::SMR000105321::cid_1370094
SMILES O=C(Nc1ccncc1)c1cc2ccccc2o1
InChI Key InChIKey=UUJZTAWXRCVZEQ-UHFFFAOYSA-N
Data  1 IC50  1 EC50
  Tab Delimited (TSV)   2D SDfile   Computed 3D by Vconf -m prep SDfile
Find this compound or compounds like it in BindingDB:
Activity Spreadsheet -- Enzyme Inhibition Constant Data from BindingDB
Found 2 hits for monomerid = 39308
TargetBcl-2-like protein 10 [11-204](Homo sapiens (Human))
Nmmlsc
Curated by PubChem BioAssay
LigandPNGBDBM39308(MLS000109378 | N-(4-pyridyl)coumarilamide | N-pyri...)
Affinity DataEC50:  6.21E+4nM. Assay description: University of New Mexico Assay Overview: Assay Support: NIH 1X01 MH079850-01 HTS to identify small molecule regulators of Bcl-2 family protein int...
In DepthDetails PCBioAssay
TargetRho-associated protein kinase 2(Homo sapiens (Human))
The Scripps Research Institute Molecular Screening Center
Curated by PubChem BioAssay
LigandPNGBDBM39308(MLS000109378 | N-(4-pyridyl)coumarilamide | N-pyri...)
Affinity DataIC50:  2.64E+4nM. Assay description: Source (MLSCN Center Name): The Scripps Research Institute Molecular Screening Center Center Affiliation: The Scripps Research Institute, TSRI Assay ...
In DepthDetails PCBioAssay