BDBM40091 6-(2-furanyl)-3-methyl-4-oxo-1,5,6,7-tetrahydroindole-2-carboxylic acid [(E)-but-2-enyl] ester::6-(2-furyl)-4-keto-3-methyl-1,5,6,7-tetrahydroindole-2-carboxylic acid [(E)-but-2-enyl] ester::MLS000116533::SMR000093503::[(E)-but-2-enyl] 6-(furan-2-yl)-3-methyl-4-oxidanylidene-1,5,6,7-tetrahydroindole-2-carboxylate::[(E)-but-2-enyl] 6-(furan-2-yl)-3-methyl-4-oxo-1,5,6,7-tetrahydroindole-2-carboxylate::cid_5307612
SMILES C\C=C\COC(=O)c1[nH]c2CC(CC(=O)c2c1C)c1ccco1
InChI Key InChIKey=OGLZJGGVPOZKKC-ONEGZZNKSA-N
Data  4 IC50
  Tab Delimited (TSV)   2D SDfile   Computed 3D by Vconf -m prep SDfile
Find this compound or compounds like it in BindingDB:
Activity Spreadsheet -- Enzyme Inhibition Constant Data from BindingDB
Found 4 hits for monomerid = 40091
TargetEstrogen receptor(Homo sapiens (Human))
Emory University
Curated by PubChem BioAssay
LigandPNGBDBM40091(6-(2-furanyl)-3-methyl-4-oxo-1,5,6,7-tetrahydroind...)
Affinity DataIC50:  2.47E+4nM. Assay description: NIH Molecular Libraries Screening Centers Network [MLSCN] Emory Chemical Biology Discovery Center in MLSCN Assay provider: John A. Katzenellenbogen, ...
In DepthDetails PCBioAssay
TargetEukaryotic translation initiation factor 4H(Homo sapiens (Human))
Burnham Center For Chemical Genomics
Curated by PubChem BioAssay
LigandPNGBDBM40091(6-(2-furanyl)-3-methyl-4-oxo-1,5,6,7-tetrahydroind...)
Affinity DataIC50:  2.17E+4nM. Assay description: Data Source: Sanford-Burnham Center for Chemical Genomics (SBCCG) Source Affiliation: Sanford-Burnham Medical Research Institute (SBMRI, San Diego, C...
In DepthDetails PCBioAssay
TargetPolyadenylate-binding protein 1(Homo sapiens (Human))
Burnham Center For Chemical Genomics
Curated by PubChem BioAssay
LigandPNGBDBM40091(6-(2-furanyl)-3-methyl-4-oxo-1,5,6,7-tetrahydroind...)
Affinity DataIC50:  4.58E+4nM. Assay description: Data Source: Sanford-Burnham Center for Chemical Genomics (SBCCG) Source Affiliation: Sanford-Burnham Medical Research Institute (SBMRI, San Diego, C...
In DepthDetails PCBioAssay
TargetEstrogen receptor beta(Homo sapiens (Human))
Emory University
Curated by PubChem BioAssay
LigandPNGBDBM40091(6-(2-furanyl)-3-methyl-4-oxo-1,5,6,7-tetrahydroind...)
Affinity DataIC50:  5.00E+4nM. Assay description: NIH Molecular Libraries Screening Centers Network [MLSCN] Emory Chemical Biology Discovery Center in MLSCN Assay provider: John A. Katzenellenbogen, ...
In DepthDetails PCBioAssay