BDBM40918 3-butyl-6-(4-morpholinyl)-1H-pyrimidine-2,4-dione::3-butyl-6-morpholin-4-yl-1H-pyrimidine-2,4-dione::3-butyl-6-morpholino-uracil::MLS000102780::SMR000018178::cid_5310386
SMILES CCCCn1c(=O)cc([nH]c1=O)N1CCOCC1
InChI Key InChIKey=CSRZEZJZWYVBFK-UHFFFAOYSA-N
Data  1 IC50
  Tab Delimited (TSV)   2D SDfile   Computed 3D by Vconf -m prep SDfile
Find this compound or compounds like it in BindingDB:
Activity Spreadsheet -- Enzyme Inhibition Constant Data from BindingDB
Found 1 hit for monomerid = 40918
TargetComplement C1s subcomponent(Homo sapiens (Human))
Pcmd
Curated by PubChem BioAssay
LigandPNGBDBM40918(3-butyl-6-(4-morpholinyl)-1H-pyrimidine-2,4-dione ...)
Affinity DataIC50: >5.00E+4nM. Assay description: Molecular Library Screening Center Network (MLSCN) Penn Center for Molecular Discovery (PCMD) Assay Provider: Dr. Scott L. Diamond, University of Pen...
In DepthDetails PCBioAssay