BDBM41173 2-(4-ethoxyanilino)-6-oxo-N-(phenylmethyl)-4,5-dihydro-1H-pyrimidine-4-carboxamide::2-[(4-ethoxyphenyl)amino]-6-oxidanylidene-N-(phenylmethyl)-4,5-dihydro-1H-pyrimidine-4-carboxamide::MLS000097362::N-benzyl-2-(4-ethoxyanilino)-6-oxo-4,5-dihydro-1H-pyrimidine-4-carboxamide::N-benzyl-2-[(4-ethoxyphenyl)amino]-6-oxo-1,4,5,6-tetrahydro-4-pyrimidinecarboxamide::N-benzyl-6-keto-2-(p-phenetidino)-4,5-dihydro-1H-pyrimidine-4-carboxamide::SMR000075989::cid_2952291
SMILES CCOc1ccc(NC2=NC(CC(=O)N2)C(=O)NCc2ccccc2)cc1
InChI Key InChIKey=VJCGIBLBROKIAS-UHFFFAOYSA-N
Data  2 IC50
  Tab Delimited (TSV)   2D SDfile   Computed 3D by Vconf -m prep SDfile
Find this compound or compounds like it in BindingDB:
Activity Spreadsheet -- Enzyme Inhibition Constant Data from BindingDB
Found 2 hits for monomerid = 41173
TargetProcathepsin L(Homo sapiens (Human))
Pcmd
Curated by PubChem BioAssay
LigandPNGBDBM41173(2-(4-ethoxyanilino)-6-oxo-N-(phenylmethyl)-4,5-dih...)
Affinity DataIC50: >5.00E+4nM. Assay description: Screening Center: Penn Center for Molecular Discovery Center Affiliation: University of Pennsylvania Network: Molecular Library Screening Center Netw...
In DepthDetails PCBioAssay
TargetProcathepsin L(Homo sapiens (Human))
Pcmd
Curated by PubChem BioAssay
LigandPNGBDBM41173(2-(4-ethoxyanilino)-6-oxo-N-(phenylmethyl)-4,5-dih...)
Affinity DataIC50: >5.00E+4nM. Assay description: Screening Center: Penn Center for Molecular Discovery Center Affiliation: University of Pennsylvania Network: Molecular Library Screening Center Netw...
In DepthDetails PCBioAssay