BDBM41438 1,3-dimethyl-8-(2-phenylethylamino)-7-prop-2-enyl-purine-2,6-dione::1,3-dimethyl-8-(2-phenylethylamino)-7-prop-2-enylpurine-2,6-dione::7-allyl-1,3-dimethyl-8-(phenethylamino)xanthine::MLS000037491::SMR000017223::cid_659506
SMILES Cn1c2nc(NCCc3ccccc3)n(CC=C)c2c(=O)n(C)c1=O
InChI Key InChIKey=GMZFNHMEVCUFRT-UHFFFAOYSA-N
Data  1 IC50
  Tab Delimited (TSV)   2D SDfile   Computed 3D by Vconf -m prep SDfile
Find this compound or compounds like it in BindingDB:
Activity Spreadsheet -- Enzyme Inhibition Constant Data from BindingDB
Found 1 hit for monomerid = 41438
TargetEphrin type-B receptor 4(Homo sapiens (Human))
The Scripps Research Institute Molecular Screening Center
Curated by PubChem BioAssay
LigandPNGBDBM41438(1,3-dimethyl-8-(2-phenylethylamino)-7-prop-2-enyl-...)
Affinity DataIC50: >7.94E+4nM. Assay description: Source (MLSCN Center Name): The Scripps Research Institute Molecular Screening Center Center Affiliation: The Scripps Research Institute, TSRI Assay ...
In DepthDetails PCBioAssay