BDBM41596 2-[5,7-bis(trifluoromethyl)-1,8-naphthyridin-2-yl]-2-(3-chlorophenyl)acetonitrile::2-[5,7-bis(trifluoromethyl)-1,8-naphthyridin-2-yl]-2-(3-chlorophenyl)ethanenitrile::2-[5,7-bis(trifluoromethyl)[1,8]naphthyridin-2-yl]-2-(3-chlorophenyl)acetonitrile::MLS000540886::SMR000125944::cid_3803930
SMILES FC(F)(F)c1cc(c2ccc(nc2n1)C(C#N)c1cccc(Cl)c1)C(F)(F)F
InChI Key InChIKey=QPWWAOMXYPIDOY-UHFFFAOYSA-N
Data  2 IC50  1 EC50
  Tab Delimited (TSV)   2D SDfile   Computed 3D by Vconf -m prep SDfile
Find this compound or compounds like it in BindingDB:
Activity Spreadsheet -- Enzyme Inhibition Constant Data from BindingDB
Found 3 hits for monomerid = 41596
TargetSphingosine 1-phosphate receptor 2(Homo sapiens (Human))
The Scripps Research Institute Molecular Screening Center
Curated by PubChem BioAssay
LigandPNGBDBM41596(2-[5,7-bis(trifluoromethyl)-1,8-naphthyridin-2-yl]...)
Affinity DataIC50:  922nM. Assay description: Source (MLSCN Center Name): The Scripps Research Institute Molecular Screening Center Center Affiliation: The Scripps Research Institute (TSRI) Assay...
In DepthDetails PCBioAssay
TargetVoltage-dependent T-type calcium channel subunit alpha-1H(Homo sapiens (Human))
Vanderbilt Screening Center For Gpcrs, Ion Channels and Transporters
Curated by PubChem BioAssay
LigandPNGBDBM41596(2-[5,7-bis(trifluoromethyl)-1,8-naphthyridin-2-yl]...)
Affinity DataEC50:  3.85E+3nM. Assay description: Assay Provider: Xinmin Xie Assay Provider Affiliation: Bioscience Division, SRI International, Menlo Park, CA Grant Title: HTS Assay for Cav3 T-Type ...
In DepthDetails PCBioAssay
TargetSphingosine 1-phosphate receptor 2(Homo sapiens (Human))
The Scripps Research Institute Molecular Screening Center
Curated by PubChem BioAssay
LigandPNGBDBM41596(2-[5,7-bis(trifluoromethyl)-1,8-naphthyridin-2-yl]...)
Affinity DataIC50:  90nM. Assay description: Source (MLSCN Center Name): The Scripps Research Institute Molecular Screening Center Center Affiliation: The Scripps Research Institute (TSRI) Assay...
In DepthDetails PCBioAssay