BDBM416432 1-ethyl-N-((R)-1-(4-(ethylsulfonyl)phenyl)-2-hydroxyethyl)-2-(((1r,4R)-4-(trifluoromethyl)cyclohexyl)methyl)-1H-indole-5-carboxamide1-ethyl-N-((R)-1-(4-(ethylsulfonyl)phenyl)-2-hydroxyethyl)-2-(((1s,4S)-4-(trifluoromethyl)cyclohexyl)methyl)-1H-indole-5-carboxamide::US10301261, Compound IN-16.1::US10301261, Compound IN-16.2::US10829448, Compound IN-16.1
SMILES CCn1c(C[C@H]2CC[C@@H](CC2)C(F)(F)F)cc2cc(ccc12)C(=O)N[C@@H](CO)c1ccc(cc1)S(=O)(=O)CC
InChI Key InChIKey=FIXCUODLRNJFOC-CZZAQMAHSA-N
Data  4 KI  2 IC50
  Tab Delimited (TSV)   2D SDfile   Computed 3D by Vconf -m prep SDfile
Find this compound or compounds like it in BindingDB:
Activity Spreadsheet -- Enzyme Inhibition Constant Data from BindingDB
Found 6 hits for monomerid = 416432
TargetNuclear receptor ROR-gamma(Homo sapiens (Human))
Vitae Pharmaceuticals
US Patent
LigandPNGBDBM416432(1-ethyl-N-((R)-1-(4-(ethylsulfonyl)phenyl)-2-hydro...)
Affinity DataKi: <100nM. Assay description: Compounds described herein were tested for ability to bind to RORγ in a cell-free competition assay with commercially available radio-ligand (RL...
Ligand InfoPC cidPC sid
In DepthDetails US Patent
TargetNuclear receptor ROR-gamma(Homo sapiens (Human))
Vitae Pharmaceuticals
US Patent
LigandPNGBDBM416432(1-ethyl-N-((R)-1-(4-(ethylsulfonyl)phenyl)-2-hydro...)
Affinity DataKi: <100nM. Assay description: Compounds described herein were tested for ability to bind to RORγ in a cell-free competition assay with commercially available radio-ligand (RL...
Ligand InfoPC cidPC sid
In DepthDetails US Patent
TargetNuclear receptor ROR-gamma(Homo sapiens (Human))
Vitae Pharmaceuticals
US Patent
LigandPNGBDBM416432(1-ethyl-N-((R)-1-(4-(ethylsulfonyl)phenyl)-2-hydro...)
Affinity DataKi: <100nM. Assay description: Compounds described herein were tested for ability to bind to RORγ in a cell-free competition assay with commercially available radio-ligand (RL...
Ligand InfoPC cidPC sid
In DepthDetails US Patent
TargetNuclear receptor ROR-gamma(Homo sapiens (Human))
Vitae Pharmaceuticals
US Patent
LigandPNGBDBM416432(1-ethyl-N-((R)-1-(4-(ethylsulfonyl)phenyl)-2-hydro...)
Affinity DataKi: <100nM. Assay description: Compounds described herein were tested for ability to bind to RORγ in a cell-free competition assay with commercially available radio-ligand (RL...
Ligand InfoPC cidPC sid
In DepthDetails US Patent
TargetNuclear receptor ROR-gamma(Homo sapiens (Human))
Vitae Pharmaceuticals
US Patent
LigandPNGBDBM416432(1-ethyl-N-((R)-1-(4-(ethylsulfonyl)phenyl)-2-hydro...)
Affinity DataIC50: >1.00E+3nM. Assay description: Compounds described herein were tested for RORγ inverse agonist activity in a cell-based, transcriptional activity assay. Secreted NanolucŪ luci...
Ligand InfoPC cidPC sid
In DepthDetails US Patent
TargetNuclear receptor ROR-gamma(Homo sapiens (Human))
Vitae Pharmaceuticals
US Patent
LigandPNGBDBM416432(1-ethyl-N-((R)-1-(4-(ethylsulfonyl)phenyl)-2-hydro...)
Affinity DataIC50: <100nM. Assay description: Compounds described herein were tested for RORγ inverse agonist activity in a cell-based, transcriptional activity assay. Secreted NanolucŪ luci...
Ligand InfoPC cidPC sid
In DepthDetails US Patent