BDBM41749 2-(2-Methoxy-phenyl)-3-(3-trifluoromethyl-benzenesulfonyl)-thiazolidine::2-(2-methoxyphenyl)-3-[3-(trifluoromethyl)phenyl]sulfonyl-1,3-thiazolidine::2-(2-methoxyphenyl)-3-[3-(trifluoromethyl)phenyl]sulfonyl-thiazolidine::2-(2-methoxyphenyl)-3-[3-(trifluoromethyl)phenyl]sulfonylthiazolidine::MLS000030697::SMR000011601::cid_646735
SMILES COc1ccccc1C1SCCN1S(=O)(=O)c1cccc(c1)C(F)(F)F
InChI Key InChIKey=IANULKJFHGLGOX-UHFFFAOYSA-N
Data  2 IC50  2 EC50
  Tab Delimited (TSV)   2D SDfile   Computed 3D by Vconf -m prep SDfile
Find this compound or compounds like it in BindingDB:
Activity Spreadsheet -- Enzyme Inhibition Constant Data from BindingDB
Found 4 hits for monomerid = 41749
TargetSerine/threonine-protein kinase PLK1(Homo sapiens (Human))
University of Pittsburgh
Curated by PubChem BioAssay
LigandPNGBDBM41749(2-(2-Methoxy-phenyl)-3-(3-trifluoromethyl-benzenes...)
Affinity DataEC50: >5.00E+4nM. Assay description: List of compounds to be tested: Compounds that met the active criterion of Z-score is
In DepthDetails PCBioAssay
TargetE3 ubiquitin-protein ligase XIAP(Homo sapiens (Human))
Sanford-Burnham Center For Chemical Genomics
Curated by PubChem BioAssay
LigandPNGBDBM41749(2-(2-Methoxy-phenyl)-3-(3-trifluoromethyl-benzenes...)
Affinity DataIC50:  1.00E+5nM. Assay description: Data Source: Sanford-Burnham Center for Chemical Genomics (SBCCG) Source Affiliation: Sanford-Burnham Medical Research Institute (SBMRI, San Diego, C...
In DepthDetails PCBioAssay
TargetSerine/threonine-protein kinase PLK1(Homo sapiens (Human))
University of Pittsburgh
Curated by PubChem BioAssay
LigandPNGBDBM41749(2-(2-Methoxy-phenyl)-3-(3-trifluoromethyl-benzenes...)
Affinity DataEC50: >5.00E+4nM. Assay description: List of compounds to be tested: Compounds that met the active criterion of Z-score is
In DepthDetails PCBioAssay
TargetSerine/threonine-protein kinase PLK1(Homo sapiens (Human))
University of Pittsburgh
Curated by PubChem BioAssay
LigandPNGBDBM41749(2-(2-Methoxy-phenyl)-3-(3-trifluoromethyl-benzenes...)
Affinity DataIC50: >5.00E+4nM. Assay description: List of compounds to be tested: Compounds that met the active criterion of Z-score is
In DepthDetails PCBioAssay