BDBM41845 3-nitro-N-[2,2,2-trichloro-1-({[(2,4-dichlorophenyl)amino]carbonothioyl}amino)ethyl]benzamide::3-nitro-N-[2,2,2-trichloro-1-[(2,4-dichlorophenyl)carbamothioylamino]ethyl]benzamide::3-nitro-N-[2,2,2-trichloro-1-[(2,4-dichlorophenyl)thiocarbamoylamino]ethyl]benzamide::3-nitro-N-[2,2,2-trichloro-1-[[(2,4-dichloroanilino)-sulfanylidenemethyl]amino]ethyl]benzamide::3-nitro-N-[2,2,2-tris(chloranyl)-1-[(2,4-dichlorophenyl)carbamothioylamino]ethyl]benzamide::MLS000573675::SMR000184524::cid_2830011
SMILES [O-][N+](=O)c1cccc(c1)C(=O)NC(NC(=S)Nc1ccc(Cl)cc1Cl)C(Cl)(Cl)Cl
InChI Key InChIKey=VAKBSJSQKQOLBN-UHFFFAOYSA-N
Data  3 IC50  2 EC50
  Tab Delimited (TSV)   2D SDfile   Computed 3D by Vconf -m prep SDfile
Find this compound or compounds like it in BindingDB:
Activity Spreadsheet -- Enzyme Inhibition Constant Data from BindingDB
Found 5 hits for monomerid = 41845
TargetSerine/threonine-protein kinase PLK1(Homo sapiens (Human))
University of Pittsburgh
Curated by PubChem BioAssay
LigandPNGBDBM41845(3-nitro-N-[2,2,2-trichloro-1-({[(2,4-dichloropheny...)
Affinity DataEC50: >5.00E+4nM. Assay description: List of compounds to be tested: Compounds that met the active criterion of Z-score is
In DepthDetails PCBioAssay
TargetSerine/threonine-protein kinase PLK1(Homo sapiens (Human))
University of Pittsburgh
Curated by PubChem BioAssay
LigandPNGBDBM41845(3-nitro-N-[2,2,2-trichloro-1-({[(2,4-dichloropheny...)
Affinity DataIC50: >5.00E+4nM. Assay description: List of compounds to be tested: Compounds that met the active criterion of Z-score is
In DepthDetails PCBioAssay
TargetProtein RecA(Mycobacterium tuberculosis H37Rv)
Southern Research Specialized Biocontainment Screening Center
Curated by PubChem BioAssay
LigandPNGBDBM41845(3-nitro-N-[2,2,2-trichloro-1-({[(2,4-dichloropheny...)
Affinity DataIC50:  9.33E+3nM. Assay description: Southern Research's Specialized Biocontainment Screening Center (SRSBSC) Southern Research Institute (Birmingham, Alabama) NIH Molecular Librarie...
In DepthDetails PCBioAssay
TargetGlycoprotein 42(Human herpesvirus 4 type 2)
Emory University
Curated by PubChem BioAssay
LigandPNGBDBM41845(3-nitro-N-[2,2,2-trichloro-1-({[(2,4-dichloropheny...)
Affinity DataIC50:  5.40E+4nM. Assay description: NIH Molecular Libraries Screening Centers Network [MLSCN] Emory Chemical Biology Discovery Center in MLSCN Assay provider: Theodore Jardetzky; Northw...
In DepthDetails PCBioAssay
TargetSerine/threonine-protein kinase PLK1(Homo sapiens (Human))
University of Pittsburgh
Curated by PubChem BioAssay
LigandPNGBDBM41845(3-nitro-N-[2,2,2-trichloro-1-({[(2,4-dichloropheny...)
Affinity DataEC50:  2.82E+4nM. Assay description: List of compounds to be tested: Compounds that met the active criterion of Z-score is
In DepthDetails PCBioAssay