BDBM41858 3-(4-methoxyphenyl)-4-methyl-2H-pyrano[2,3-c]pyrazol-6-one::MLS-0111581.0001::cid_645275
SMILES COc1ccc(cc1)-c1[nH]nc2oc(=O)cc(C)c12
InChI Key InChIKey=YFPHQSKGSGTAOI-UHFFFAOYSA-N
Data  4 IC50
  Tab Delimited (TSV)   2D SDfile   Computed 3D by Vconf -m prep SDfile
Find this compound or compounds like it in BindingDB:
Activity Spreadsheet -- Enzyme Inhibition Constant Data from BindingDB
Found 4 hits for monomerid = 41858
TargetAlkaline phosphatase, germ cell type(Homo sapiens (Human))
Sanford-Burnham Center For Chemical Genomics
Curated by PubChem BioAssay
LigandPNGBDBM41858(3-(4-methoxyphenyl)-4-methyl-2H-pyrano[2,3-c]pyraz...)
Affinity DataIC50: >1.00E+5nM. Assay description: Data Source: Sanford-Burnham Center for Chemical Genomics (SBCCG) Source Affiliation: Sanford-Burnham Medical Research Institute (SBMRI, San Diego, C...
In DepthDetails PCBioAssay
TargetFructose-bisphosphate aldolase(Mycobacterium tuberculosis (strain H37Rv))
The Scripps Research Institute Molecular Screening Center
Curated by PubChem BioAssay
LigandPNGBDBM41858(3-(4-methoxyphenyl)-4-methyl-2H-pyrano[2,3-c]pyraz...)
Affinity DataIC50:  1.88E+3nM
In DepthDetails PCBioAssay
TargetAlkaline phosphatase, tissue-nonspecific isozyme(Homo sapiens (Human))
Burnham Center For Chemical Genomics
Curated by PubChem BioAssay
LigandPNGBDBM41858(3-(4-methoxyphenyl)-4-methyl-2H-pyrano[2,3-c]pyraz...)
Affinity DataIC50:  1.06E+3nM. Assay description: Sanford-Burnham Center for Chemical Genomics (SBCCG) Sanford-Burnham Medical Research Institute (SBMRI, San Diego, CA) NIH Molecular Libraries Screen...
In DepthDetails PCBioAssay
TargetAlkaline phosphatase, tissue-nonspecific isozyme(Homo sapiens (Human))
Burnham Center For Chemical Genomics
Curated by PubChem BioAssay
LigandPNGBDBM41858(3-(4-methoxyphenyl)-4-methyl-2H-pyrano[2,3-c]pyraz...)
Affinity DataIC50:  1.35E+3nM. Assay description: Sanford-Burnham Center for Chemical Genomics (SBCCG) Sanford-Burnham Medical Research Institute (SBMRI, San Diego, CA) NIH Molecular Libraries Screen...
In DepthDetails PCBioAssay