BDBM41954 MLS000696560::N'-(4,6-dimethyl-1,3-benzothiazol-2-yl)-4-(3-methylpiperidin-1-yl)sulfonyl-benzohydrazide::N'-(4,6-dimethyl-1,3-benzothiazol-2-yl)-4-(3-methylpiperidin-1-yl)sulfonylbenzohydrazide::N'-(4,6-dimethyl-1,3-benzothiazol-2-yl)-4-(3-methylpiperidino)sulfonyl-benzohydrazide::N'-(4,6-dimethyl-1,3-benzothiazol-2-yl)-4-[(3-methyl-1-piperidinyl)sulfonyl]benzohydrazide::SMR000235775::cid_12006202
SMILES CC1CCCN(C1)S(=O)(=O)c1ccc(cc1)C(=O)NNc1nc2c(C)cc(C)cc2s1
InChI Key InChIKey=MFHDEYXRRYOWCK-UHFFFAOYSA-N
Data  3 IC50  3 EC50
  Tab Delimited (TSV)   2D SDfile   Computed 3D by Vconf -m prep SDfile
Find this compound or compounds like it in BindingDB:
Activity Spreadsheet -- Enzyme Inhibition Constant Data from BindingDB
Found 6 hits for monomerid = 41954
TargetGalanin receptor type 2(Homo sapiens (Human))
The Scripps Research Institute Molecular Screening Center
Curated by PubChem BioAssay
LigandPNGBDBM41954(MLS000696560 | N'-(4,6-dimethyl-1,3-benzothiazol-2...)
Affinity DataEC50: >5.57E+4nM. Assay description: Source (MLSCN Center Name): The Scripps Research Institute Molecular Screening Center Affiliation: The Scripps Florida Research Institute, TSRI Assay...
In DepthDetails PCBioAssay
TargetGalanin receptor type 2(Homo sapiens (Human))
The Scripps Research Institute Molecular Screening Center
Curated by PubChem BioAssay
LigandPNGBDBM41954(MLS000696560 | N'-(4,6-dimethyl-1,3-benzothiazol-2...)
Affinity DataEC50: >5.57E+4nM. Assay description: Source (MLSCN Center Name): The Scripps Research Institute Molecular Screening Center Affiliation: The Scripps Florida Research Institute (TSRI) Assa...
In DepthDetails PCBioAssay
TargetPerilipin-5(Homo sapiens (Human))
The Scripps Research Institute Molecular Screening Center
Curated by PubChem BioAssay
LigandPNGBDBM41954(MLS000696560 | N'-(4,6-dimethyl-1,3-benzothiazol-2...)
Affinity DataIC50:  5.27E+3nM
In DepthDetails PCBioAssay
TargetHepatocyte nuclear factor 4-alpha(Homo sapiens (Human))
The Scripps Research Institute Molecular Screening Center
Curated by PubChem BioAssay
LigandPNGBDBM41954(MLS000696560 | N'-(4,6-dimethyl-1,3-benzothiazol-2...)
Affinity DataIC50: >3.98E+4nM
In DepthDetails PCBioAssay
TargetPerilipin-1(Homo sapiens (Human))
The Scripps Research Institute Molecular Screening Center
Curated by PubChem BioAssay
LigandPNGBDBM41954(MLS000696560 | N'-(4,6-dimethyl-1,3-benzothiazol-2...)
Affinity DataIC50:  3.01E+3nM
In DepthDetails PCBioAssay
TargetStreptokinase A(Streptococcus pyogenes M1 GAS)
Broad Institute
Curated by PubChem BioAssay
LigandPNGBDBM41954(MLS000696560 | N'-(4,6-dimethyl-1,3-benzothiazol-2...)
Affinity DataEC50:  1.50E+5nM. Assay description: Keywords: Group A streptococcus, GAS, streptokinase, expression, virulence, inhibition, dose response, EC50 Assay Overview: The goal of this assa...
In DepthDetails PCBioAssay