BDBM43433 4-chloranyl-N-[2-(cyclohexen-1-yl)ethyl]-3-nitro-benzamide::4-chloro-N-[2-(1-cyclohexen-1-yl)ethyl]-3-nitrobenzamide::4-chloro-N-[2-(1-cyclohexenyl)ethyl]-3-nitrobenzamide::4-chloro-N-[2-(cyclohexen-1-yl)ethyl]-3-nitro-benzamide::4-chloro-N-[2-(cyclohexen-1-yl)ethyl]-3-nitrobenzamide::MLS000666610::SMR000268282::cid_873835
SMILES [O-][N+](=O)c1cc(ccc1Cl)C(=O)NCCC1=CCCCC1
InChI Key InChIKey=YNDMIHODAMPJMP-UHFFFAOYSA-N
Data  1 EC50
  Tab Delimited (TSV)   2D SDfile   Computed 3D by Vconf -m prep SDfile
Find this compound or compounds like it in BindingDB:
Activity Spreadsheet -- Enzyme Inhibition Constant Data from BindingDB
Found 1 hit for monomerid = 43433
TargetE3 ubiquitin-protein ligase Mdm2(Homo sapiens (Human))
Pcmd
Curated by PubChem BioAssay
LigandPNGBDBM43433(4-chloranyl-N-[2-(cyclohexen-1-yl)ethyl]-3-nitro-b...)
Affinity DataEC50:  7.21E+6nM. Assay description: Molecular Library Screening Center Network (MLSCN) Penn Center for Molecular Discovery (PCMD) Assay Provider: Brent Stockwell, Columbia University ML...
In DepthDetails PCBioAssay