BDBM449616 US10703733, Example 229
SMILES CO[C@H]1\C=C\C[C@H](C)[C@@H](C)[S@@](=O)(NC(=O)c2cc3CO[C@@H](CN4CCN5CCOC[C@H]5C4)Cn3c2)=NC(=O)c2ccc3OC[C@]4(CCCc5cc(Cl)ccc45)CN(C[C@@H]4CC[C@@H]14)c3c2
InChI Key InChIKey=SLFPPLQKWSOYLR-KQNFACRGSA-N
Data  1 IC50
  Tab Delimited (TSV)   2D SDfile   Computed 3D by Vconf -m prep SDfile
Find this compound or compounds like it in BindingDB:
Activity Spreadsheet -- Enzyme Inhibition Constant Data from BindingDB
Found 1 hit for monomerid = 449616
LigandPNGBDBM449616(US10703733, Example 229)
Affinity DataIC50:  0.0300nM. Assay description: The AlphaLISA assay was performed in a 384-well Proxiplate in a total volume of 40 μL. The reaction mixture contained 0.0625 nM 6×His-Mcl-1 (171...
Ligand InfoPC cidPC sid
In DepthDetails US Patent