BDBM463332 3-Amino-1-[(4-(2-oxo-2H-pyridin-1-ylmethyl)-benzyl]-1H-pyrazole-4-carboxylic acid [2-(3-chloro-phenoxy)-ethyl]-amide::US10781181, Example 1
SMILES Nc1nn(Cc2ccc(Cn3ccccc3=O)cc2)cc1C(=O)NCCOc1cccc(Cl)c1
InChI Key InChIKey=BKOMRHGWSXFZSH-UHFFFAOYSA-N
Data  5 IC50
  Tab Delimited (TSV)   2D SDfile   Computed 3D by Vconf -m prep SDfile
Find this compound or compounds like it in BindingDB:
Activity Spreadsheet -- Enzyme Inhibition Constant Data from BindingDB
Found 5 hits for monomerid = 463332
TargetPlasma kallikrein(Homo sapiens (Human))
Kalvista Pharmaceuticals
US Patent
LigandPNGBDBM463332(3-Amino-1-[(4-(2-oxo-2H-pyridin-1-ylmethyl)-benzyl...)
Affinity DataIC50:  2.90nM. Assay description: Plasma kallikrein inhibitory activity in vitro was determined using standard published methods. Human plasma kallikrein (Protogen) was incubated at 2...
Ligand InfoPC cidPC sid
In DepthDetails US Patent
TargetKallikrein-1(Homo sapiens (Human))
Kalvista Pharmaceuticals
US Patent
LigandPNGBDBM463332(3-Amino-1-[(4-(2-oxo-2H-pyridin-1-ylmethyl)-benzyl...)
Affinity DataIC50: >1.00E+4nM. Assay description: KLK1 inhibitory activity in vitro was determined using standard published methods. Human KLK1 (Callbiochem) was incubated at 25° C. with the fluoroge...
Ligand InfoPC cidPC sid
In DepthDetails US Patent
TargetKallikrein-1(Homo sapiens (Human))
Kalvista Pharmaceuticals
US Patent
LigandPNGBDBM463332(3-Amino-1-[(4-(2-oxo-2H-pyridin-1-ylmethyl)-benzyl...)
Affinity DataIC50:  2.90nM. Assay description: Inhibition of KLK1 (unknown origin)
Ligand InfoPC cidPC sid
In DepthDetails PubMed
TargetCoagulation factor XI(Homo sapiens (Human))TBA
LigandPNGBDBM463332(3-Amino-1-[(4-(2-oxo-2H-pyridin-1-ylmethyl)-benzyl...)
Affinity DataIC50:  2.90nM. Assay description: Inhibition of fXIa (unknown origin)
Ligand InfoPC cidPC sid
In DepthDetails PubMed
TargetPlasma kallikrein(Homo sapiens (Human))
Kalvista Pharmaceuticals
US Patent
LigandPNGBDBM463332(3-Amino-1-[(4-(2-oxo-2H-pyridin-1-ylmethyl)-benzyl...)
Affinity DataIC50:  2.90nM. Assay description: Inhibition of plasma kallikrein (unknown origin)
Ligand InfoPC cidPC sid
In DepthDetails PubMed