BDBM464450 US10793528, Example SC_5020
SMILES CN(C)C(=O)CCNC(=O)CCN1C[C@]2(CC[C@@](CC2)(N(C)C)c2ccccc2)N(CC2CCC2)C1=O
InChI Key InChIKey=AOAHTPZABFAKKS-ISILISOKSA-N
Data  2 KI
  Tab Delimited (TSV)   2D SDfile   Computed 3D by Vconf -m prep SDfile
Find this compound or compounds like it in BindingDB:
Activity Spreadsheet -- Enzyme Inhibition Constant Data from BindingDB
Found 2 hits for monomerid = 464450
TargetPrepronociceptin(Human)
GrÜNenthal
US Patent
LigandPNGBDBM464450(US10793528, Example SC_5020)
Affinity DataKi:  8.10nM. Assay description: NOP:The hNOP receptor binding assay was performed as homogeneous SPA-assay (scintillation proximity assay) using the assay buffer 50 mM TRIS-HCl. 10 ...
Ligand InfoPC cidPC sid
In DepthDetails US Patent
TargetMu-type opioid receptor(Homo sapiens (Human))
GrÜNenthal
US Patent
LigandPNGBDBM464450(US10793528, Example SC_5020)
Affinity DataKi:  47.5nM. Assay description: MOP: The hMOP receptor binding assay was performed as homogeneous SPA-assay (scintillation proximity assay) using the assay buffer 50 mM TRIS-HCl (pH...
Ligand InfoPC cidPC sid
In DepthDetails US Patent