BDBM46501 4-ethyl-7-(4-morpholinylsulfonyl)-1,3-dihydroquinoxalin-2-one::4-ethyl-7-morpholin-4-ylsulfonyl-1,3-dihydroquinoxalin-2-one::4-ethyl-7-morpholinosulfonyl-1,3-dihydroquinoxalin-2-one::MLS000774807::SMR000365492::cid_4464475
SMILES CCN1CC(=O)Nc2cc(ccc12)S(=O)(=O)N1CCOCC1
InChI Key InChIKey=YJBPEKQUOSYKGV-UHFFFAOYSA-N
Data  2 EC50
  Tab Delimited (TSV)   2D SDfile   Computed 3D by Vconf -m prep SDfile
Find this compound or compounds like it in BindingDB:
Activity Spreadsheet -- Enzyme Inhibition Constant Data from BindingDB
Found 2 hits for monomerid = 46501
TargetEukaryotic translation initiation factor 2-alpha kinase 3(Homo sapiens (Human))
The Scripps Research Institute Molecular Screening Center
Curated by PubChem BioAssay
LigandPNGBDBM46501(4-ethyl-7-(4-morpholinylsulfonyl)-1,3-dihydroquino...)
Affinity DataEC50: >5.57E+4nM. Assay description: Source (MLPCN Center Name): The Scripps Research Institute Molecular Screening Center (SRIMSC) Center Affiliation: The Scripps Research Institute (TS...
Ligand InfoPC cidPC sid
In DepthDetails PCBioAssay
TargetEukaryotic translation initiation factor 2-alpha kinase 3(Homo sapiens (Human))
The Scripps Research Institute Molecular Screening Center
Curated by PubChem BioAssay
LigandPNGBDBM46501(4-ethyl-7-(4-morpholinylsulfonyl)-1,3-dihydroquino...)
Affinity DataEC50: >5.57E+4nM. Assay description: Source (MLPCN Center Name): The Scripps Research Institute Molecular Screening Center (SRIMSC) Center Affiliation: The Scripps Research Institute (TS...
Ligand InfoPC cidPC sid
In DepthDetails PCBioAssay