BDBM466969 2-{[(2S,5R)-2-carbamoyl-3-methyl-7-oxo-1,6-diazabicyclo[3.2.1]oct-3-en-6-yl]oxy}-2-fluoropropanoic acid lithium salt (mixture of diastereomers)::US10800778, Example 11
SMILES CC1=C[C@@H]2CN([C@@H]1C(N)=O)C(=O)N2OC(C)(F)C(O)=O
InChI Key InChIKey=SOQURWNDDXDSTI-KKOGVWMFSA-N
Data  3 IC50
  Tab Delimited (TSV)   2D SDfile   Computed 3D by Vconf -m prep SDfile
Find this compound or compounds like it in BindingDB:
Activity Spreadsheet -- Enzyme Inhibition Constant Data from BindingDB
Found 3 hits for monomerid = 466969
TargetBeta-lactamase TEM(Escherichia coli)
Entasis Therapeutics
US Patent
LigandPNGBDBM466969(2-{[(2S,5R)-2-carbamoyl-3-methyl-7-oxo-1,6-diazabi...)
Affinity DataIC50:  230nM. Assay description: A buffer consisting of 0.1 M sodium phosphate (pH 7.0), 10 mM NaHCO3, and 0.005% Triton X-100 was used for all enzymes. The chromogenic substrate nit...
Ligand InfoPC cidPC sid
In DepthDetails US Patent
TargetBeta-lactamase(Klebsiella pneumoniae)
Entasis Therapeutics
US Patent
LigandPNGBDBM466969(2-{[(2S,5R)-2-carbamoyl-3-methyl-7-oxo-1,6-diazabi...)
Affinity DataIC50:  2.20E+4nM. Assay description: A buffer consisting of 0.1 M sodium phosphate (pH 7.0), 10 mM NaHCO3, and 0.005% Triton X-100 was used for all enzymes. The chromogenic substrate nit...
Ligand InfoPC cidPC sid
In DepthDetails US Patent
TargetBeta-lactamase(Escherichia coli)
Entasis Therapeutics
US Patent
LigandPNGBDBM466969(2-{[(2S,5R)-2-carbamoyl-3-methyl-7-oxo-1,6-diazabi...)
Affinity DataIC50:  400nM. Assay description: A buffer consisting of 0.1 M sodium phosphate (pH 7.0), 10 mM NaHCO3, and 0.005% Triton X-100 was used for all enzymes. The chromogenic substrate nit...
Ligand InfoPC cidPC sid
In DepthDetails US Patent