BDBM467323 US10800786, Example 1.06
SMILES Cc1nnn(Cc2cc(ccc2CCC(=O)N2CC3=C(C2)CN(C3)C(=O)c2ccc3[nH]nnc3c2)C(F)(F)F)n1
InChI Key InChIKey=FZGILSPBZGEQKP-UHFFFAOYSA-N
Data  1 IC50
  Tab Delimited (TSV)   2D SDfile   Computed 3D by Vconf -m prep SDfile
Find this compound or compounds like it in BindingDB:
Activity Spreadsheet -- Enzyme Inhibition Constant Data from BindingDB
Found 1 hit for monomerid = 467323
TargetAtaxin-1(Homo sapiens (Human))
Hoffmann-La Roche
US Patent
LigandPNGBDBM467323(US10800786, Example 1.06)
Affinity DataIC50:  11nM. Assay description: ATX inhibition was measured by a fluorescence quenching assay using a specifically labeled substrate analogue (MR121 substrate). To obtain this MR121...
Ligand InfoPC cidPC sid
In DepthDetails US Patent