BDBM469152 N-[6-(1,5-dimethyl-6-oxopyridin-3-yl)-1-[(3- fluorophenyl)methyl]benzimidazol-4- yl]methanesulfonamide::US10807982, Example 32
SMILES Cc1cc(cn(C)c1=O)-c1cc(NS(C)(=O)=O)c2ncn(Cc3cccc(F)c3)c2c1
InChI Key InChIKey=MJDHWWHBNNBJJP-UHFFFAOYSA-N
Data  1 IC50
  Tab Delimited (TSV)   2D SDfile   Computed 3D by Vconf -m prep SDfile
Find this compound or compounds like it in BindingDB:
Activity Spreadsheet -- Enzyme Inhibition Constant Data from BindingDB
Found 1 hit for monomerid = 469152
TargetBromodomain-containing protein 4(Homo sapiens (Human))
Celgene Quanticel Research
US Patent
LigandPNGBDBM469152(N-[6-(1,5-dimethyl-6-oxopyridin-3-yl)-1-[(3- fluor...)
Affinity DataIC50: <500nM. Assay description: Determination of the IC50 for the heterocyclic derivative BRD4 inhibitors disclosed herein was performed as follows. His-tagged BREM was cloned, expr...
Ligand InfoPC cidPC sid
In DepthDetails US Patent