BDBM470189 US10807994, Compound 1.65::US10807994, Example S-65
SMILES FC(F)CN1CCc2ccc(Nc3ncc4C(=O)N(COc4n3)c3c(Cl)cccc3Cl)cc2C1
InChI Key InChIKey=GGBVKABONBYJIJ-UHFFFAOYSA-N
Data  1 IC50
  Tab Delimited (TSV)   2D SDfile   Computed 3D by Vconf -m prep SDfile
Find this compound or compounds like it in BindingDB:
Activity Spreadsheet -- Enzyme Inhibition Constant Data from BindingDB
Found 1 hit for monomerid = 470189
TargetWee1-like protein kinase(Homo sapiens (Human))
Nuvation Bio
US Patent
LigandPNGBDBM470189(US10807994, Compound 1.65 | US10807994, Example S-...)
Affinity DataIC50:  1.33E+3nM. Assay description: IC50 values of compounds against WEE1 kinase enzyme were determined by LanthaScreen™ Terbium Labeled TR-FRET assay. Kinase assays were performed in 1...
Ligand InfoPC cidPC sid
In DepthDetails US Patent