BDBM471643 US10822338, Example 25
SMILES Nc1nc2c(OC(F)F)cccc2c2nc(nn12)[C@@H]1CCCN(CC(F)F)C1
InChI Key InChIKey=VYBDFOLLSRXWHH-SECBINFHSA-N
Data  1 KI
  Tab Delimited (TSV)   2D SDfile   Computed 3D by Vconf -m prep SDfile
Find this compound or compounds like it in BindingDB:
Activity Spreadsheet -- Enzyme Inhibition Constant Data from BindingDB
Found 1 hit for monomerid = 471643
TargetAdenosine receptor A2a(Homo sapiens (Human))
Merck Sharp & Dohme
US Patent
LigandPNGBDBM471643(US10822338, Example 25)
Affinity DataKi:  1.20nM. Assay description: Binding affinities of compounds of the invention for the human A2A receptor were determined in a competition binding assay using Scintillation Proxim...
Ligand InfoPC cidPC sid
In DepthDetails US Patent