BDBM471781 1-cyclopropyl-N-((R)-1-(4- (ethylsulfonyl)phenyl)-2-hydroxyethyl)-2- (((1r,4R)-4-(trifluoromethyl)cyclohexyl)oxy)- 1H-benzo[d]imidazole-5-carboxamide::US10829448, Compound BE-1
SMILES FC(F)(F)C1CCC(CC1)OC(=O)c1ccc2n(C3CC3)c(OC3CCC(CC3)C(F)(F)F)nc2c1
InChI Key InChIKey=ICSAQAHFKWBTEG-UHFFFAOYSA-N
Data  1 KI
  Tab Delimited (TSV)   2D SDfile   Computed 3D by Vconf -m prep SDfile
Find this compound or compounds like it in BindingDB:
Activity Spreadsheet -- Enzyme Inhibition Constant Data from BindingDB
Found 1 hit for monomerid = 471781
TargetNuclear receptor ROR-gamma(Homo sapiens (Human))
Vitae Pharmaceuticals
US Patent
LigandPNGBDBM471781(1-cyclopropyl-N-((R)-1-(4- (ethylsulfonyl)phenyl)-...)
Affinity DataKi: <100nM. Assay description: Compounds described herein were tested for ability to bind to RORγ in a cell-free competition assay with commercially available radio-ligand (RL...
Ligand InfoPC cidPC sid
In DepthDetails US Patent