BDBM472349 1-(benzo[d]oxazol-4-ylmethyl)-N-(4-(ethylsulfonyl)benzyl)-2-::US10829481, Compound I-147
SMILES CCS(=O)(=O)c1ccc(CNC(=O)c2ccc3n(Cc4cccc5ocnc45)c(nc3c2)C(F)(F)F)cc1
InChI Key InChIKey=XYIUQAGOVRJLNF-UHFFFAOYSA-N
Data  1 KI
  Tab Delimited (TSV)   2D SDfile   Computed 3D by Vconf -m prep SDfile
Find this compound or compounds like it in BindingDB:
Activity Spreadsheet -- Enzyme Inhibition Constant Data from BindingDB
Found 1 hit for monomerid = 472349
TargetNuclear receptor ROR-gamma(Homo sapiens (Human))
Vitae Pharmaceuticals
US Patent
LigandPNGBDBM472349(1-(benzo[d]oxazol-4-ylmethyl)-N-(4-(ethylsulfonyl)...)
Affinity DataKi: <100nM. Assay description: Compounds described herein were tested for ability to bind to RORγ in a cell-free competition assay with commercially available radio-ligand (RL...
Ligand InfoPC cidPC sid
In DepthDetails US Patent