BDBM473002 (R)-4-bromo-5,6,6a,7,8,9,10,11-octahydro- [1,4]diazepino[1,2-a][1,8]naphthyridine::US10836764, Compound 156
SMILES Brc1ccnc2N3CCCNC[C@H]3CCc12
InChI Key InChIKey=RWJBCAMNHPNRNP-SECBINFHSA-N
Data  3 KI
  Tab Delimited (TSV)   2D SDfile   Computed 3D by Vconf -m prep SDfile
Find this compound or compounds like it in BindingDB:
Activity Spreadsheet -- Enzyme Inhibition Constant Data from BindingDB
Found 3 hits for monomerid = 473002
Target5-hydroxytryptamine receptor 2C(Homo sapiens (Human))
Arena Pharmaceuticals
US Patent
LigandPNGBDBM473002((R)-4-bromo-5,6,6a,7,8,9,10,11-octahydro- [1,4]dia...)
Affinity DataKi:  55.2nM. Assay description: Radioligand binding assays were performed using the commercially available 5-HT2 receptor agonist [125I]DOI as the radioligand and nonspecific bindin...
Ligand InfoPC cidPC sid
In DepthDetails US Patent
Target5-hydroxytryptamine receptor 2B(Homo sapiens (Human))
Arena Pharmaceuticals
US Patent
LigandPNGBDBM473002((R)-4-bromo-5,6,6a,7,8,9,10,11-octahydro- [1,4]dia...)
Affinity DataKi:  127nM. Assay description: Radioligand binding assays were performed using the commercially available 5-HT2 receptor agonist [125I]DOI as the radioligand and nonspecific bindin...
Ligand InfoPC cidPC sid
In DepthDetails US Patent
Target5-hydroxytryptamine receptor 2A(Homo sapiens (Human))
Arena Pharmaceuticals
US Patent
LigandPNGBDBM473002((R)-4-bromo-5,6,6a,7,8,9,10,11-octahydro- [1,4]dia...)
Affinity DataKi:  1.39E+3nM. Assay description: Radioligand binding assays were performed using the commercially available 5-HT2 receptor agonist [125I]DOI as the radioligand and nonspecific bindin...
Ligand InfoPC cidPC sid
In DepthDetails US Patent