BDBM473135 N-(5-cyclopropyl-1H- pyrazol-3-yl)-6-(1H- indazol-6- yl)imidazo[1,2- a]pyridin-8-amine::US10842803, Structure TABLE 1.65
SMILES C1CC1c1cc(Nc2cc(cn3ccnc23)-c2ccc3cn[nH]c3c2)n[nH]1
InChI Key InChIKey=YXTJUKDGLBHAFK-UHFFFAOYSA-N
Data  1 IC50
  Tab Delimited (TSV)   2D SDfile   Computed 3D by Vconf -m prep SDfile
Find this compound or compounds like it in BindingDB:
Activity Spreadsheet -- Enzyme Inhibition Constant Data from BindingDB
Found 1 hit for monomerid = 473135
TargetTyrosine-protein kinase SYK(Homo sapiens (Human))
Kronos Bio
US Patent
LigandPNGBDBM473135(N-(5-cyclopropyl-1H- pyrazol-3-yl)-6-(1H- indazol-...)
Affinity DataIC50:  2.20E+4nM. Assay description: A master mix minus Syk enzyme is prepared containing 1X Cell Signaling kinase buffer (25 mM Tris-HCl, pH 7.5, 5 mM beta-glycerophosphate, 2 mM dithio...
Ligand InfoPC cidPC sid
In DepthDetails US Patent