BDBM475005 US10849901, Compound 55
SMILES COc1ccc(cc1)-c1c(Cc2ccccc2)nn2c1[nH]c(cc2=O)-c1ccc(cc1)[N+]([O-])=O
InChI Key InChIKey=WNUWOKDTPXBDST-UHFFFAOYSA-N
Data  1 IC50
  Tab Delimited (TSV)   2D SDfile   Computed 3D by Vconf -m prep SDfile
Find this compound or compounds like it in BindingDB:
Activity Spreadsheet -- Enzyme Inhibition Constant Data from BindingDB
Found 1 hit for monomerid = 475005
TargetADP-ribosylation factor 6(Human)
Navigen
US Patent
LigandPNGBDBM475005(US10849901, Compound 55)
Affinity DataIC50:  3.10nM. Assay description: The primary biochemical assay uses a fluorometric assay for monitoring the replacement of bound nucleotide with a fluorogenic GTP derivative bearing ...
In DepthDetails US Patent