BDBM475723 6-[(3aR*,7aS*)-3a-methyl-5-(7H-pyrrolo[2,3-d]pyrimidin-4-yl)-1,3,4,6,7,7a-hexahydropyrrolo[3,4-c]pyridin-2-yl]-2-methyl-pyridine-3-carbonitrile ::US10851116, Example 45
SMILES Cc1nc(ccc1C#N)N1C[C@H]2CCN(C[C@@]2(C)C1)c1ncnc2[nH]ccc12
InChI Key
Data  4 EC50
  Tab Delimited (TSV)   2D SDfile   Computed 3D by Vconf -m prep SDfile
Find this compound or compounds like it in BindingDB:
Activity Spreadsheet -- Enzyme Inhibition Constant Data from BindingDB
Found 4 hits for monomerid = 475723
TargetTyrosine-protein kinase JAK1(Homo sapiens (Human))
Leo Pharma
US Patent
LigandPNGBDBM475723(6-[(3aR*,7aS*)-3a-methyl-5-(7H-pyrrolo[2,3-d]pyrim...)
Affinity DataEC50:  30nM. Assay description: Inhibition of phosphorylation of a synthetic peptide was measured in an HTRF-based assay using the TK substrate-Biotin from the Cisbio HTRFKinEASE TK...
Ligand InfoPC cidPC sid
In DepthDetails US Patent
TargetNon-receptor tyrosine-protein kinase TYK2(Homo sapiens (Human))
Leo Pharma
US Patent
LigandPNGBDBM475723(6-[(3aR*,7aS*)-3a-methyl-5-(7H-pyrrolo[2,3-d]pyrim...)
Affinity DataEC50:  1.19E+3nM. Assay description: Inhibition of phosphorylation of a synthetic peptide was measured in an HTRF-based assay using the TK substrate-Biotin from the Cisbio HTRFKinEASE TK...
Ligand InfoPC cidPC sid
In DepthDetails US Patent
TargetTyrosine-protein kinase JAK3(Homo sapiens (Human))
Leo Pharma
US Patent
LigandPNGBDBM475723(6-[(3aR*,7aS*)-3a-methyl-5-(7H-pyrrolo[2,3-d]pyrim...)
Affinity DataEC50:  120nM. Assay description: Inhibition of phosphorylation of a synthetic peptide was measured in an HTRF-based assay using the TK substrate-Biotin from the Cisbio HTRFKinEASE TK...
Ligand InfoPC cidPC sid
In DepthDetails US Patent
TargetTyrosine-protein kinase JAK2(Homo sapiens (Human))
Leo Pharma
US Patent
LigandPNGBDBM475723(6-[(3aR*,7aS*)-3a-methyl-5-(7H-pyrrolo[2,3-d]pyrim...)
Affinity DataEC50:  103nM. Assay description: Inhibition of phosphorylation of a synthetic peptide was measured in an HTRF-based assay using the TK substrate-Biotin from the Cisbio HTRFKinEASE TK...
Ligand InfoPC cidPC sid
In DepthDetails US Patent