BDBM476622 N-(4-(2-ethylhydrazine-1- carbonyl)benzyl)benzamide::US10870618, Compound 2l
SMILES CCNNC(=O)c1ccc(CNC(=O)c2ccccc2)cc1
InChI Key InChIKey=XFDKMPCSDVCXCQ-UHFFFAOYSA-N
Data  5 IC50
  Tab Delimited (TSV)   2D SDfile   Computed 3D by Vconf -m prep SDfile
Find this compound or compounds like it in BindingDB:
Activity Spreadsheet -- Enzyme Inhibition Constant Data from BindingDB
Found 5 hits for monomerid = 476622
TargetHistone deacetylase 3(Homo sapiens (Human))
Musc Foundation For Research Development
US Patent
LigandPNGBDBM476622(N-(4-(2-ethylhydrazine-1- carbonyl)benzyl)benzamid...)
Affinity DataIC50:  187nM. Assay description: Recombinant HDACs 1, 2, and 3 (BPS Biosciences) were diluted to a concentration of 1 nM in HDAC buffer. 10 uL of this solution was added in 96-well f...
Ligand InfoPC cidPC sid
In DepthDetails US Patent
TargetHistone deacetylase 3(Homo sapiens (Human))
Musc Foundation For Research Development
US Patent
LigandPNGBDBM476622(N-(4-(2-ethylhydrazine-1- carbonyl)benzyl)benzamid...)
Affinity DataIC50:  187nM. Assay description: Allosteric inhibition of C-terminal His-tagged recombinant human HDAC3 expressed in Sf9 cells pre-incubated for 2 hrs before acetylated lysine-aminom...
Ligand InfoPC cidPC sid
In DepthDetails ArticlePubMed
TargetHistone deacetylase 6(Homo sapiens (Human))
Ocean University Of China
Curated by ChEMBL
LigandPNGBDBM476622(N-(4-(2-ethylhydrazine-1- carbonyl)benzyl)benzamid...)
Affinity DataIC50:  78nM. Assay description: Inhibition of recombinant HDAC6 (unknown origin) using Boc-Lys(acetyl)-AMC as substrate preincubated for 1 hr followed by substrate addition and meas...
Ligand InfoPC cidPC sid
In DepthDetails PubMed
TargetHistone deacetylase 1(Homo sapiens (Human))
Ocean University Of China
Curated by ChEMBL
LigandPNGBDBM476622(N-(4-(2-ethylhydrazine-1- carbonyl)benzyl)benzamid...)
Affinity DataIC50:  399nM. Assay description: Inhibition of recombinant HDAC1 (unknown origin) using Boc-Lys(acetyl)-AMC as substrate preincubated for 1 hr followed by substrate addition and meas...
Ligand InfoPC cidPC sid
In DepthDetails PubMed
TargetHistone deacetylase 3(Homo sapiens (Human))
Musc Foundation For Research Development
US Patent
LigandPNGBDBM476622(N-(4-(2-ethylhydrazine-1- carbonyl)benzyl)benzamid...)
Affinity DataIC50:  427nM. Assay description: Allosteric inhibition of HDAC3 in HEK293 cell lysates pre-incubated for 2 hrs before acetylated lysine-aminomethyl coumarin-BOC addition and measured...
Ligand InfoPC cidPC sid
In DepthDetails ArticlePubMed