BDBM476630 N-(4-(2-hexylhydrazine-1- carbonyl)benzyl)cinnamamide::US10870618, Compound 3e
SMILES CCCCCCNNC(=O)c1ccc(CNC(=O)\C=C\c2ccccc2)cc1
InChI Key InChIKey=ZMJXCXWSJXRUAN-DTQAZKPQSA-N
Data  7 IC50
  Tab Delimited (TSV)   2D SDfile   Computed 3D by Vconf -m prep SDfile
Find this compound or compounds like it in BindingDB:
Activity Spreadsheet -- Enzyme Inhibition Constant Data from BindingDB
Found 7 hits for monomerid = 476630
TargetHistone deacetylase 1(Homo sapiens (Human))
Musc Foundation For Research Development
US Patent
LigandPNGBDBM476630(N-(4-(2-hexylhydrazine-1- carbonyl)benzyl)cinnamam...)
Affinity DataIC50:  81.4nM. Assay description: Recombinant HDACs 1, 2, and 3 (BPS Biosciences) were diluted to a concentration of 1 nM in HDAC buffer. 10 uL of this solution was added in 96-well f...
Ligand InfoPC cidPC sid
In DepthDetails US Patent
TargetHistone deacetylase 2(Homo sapiens (Human))
Musc Foundation For Research Development
US Patent
LigandPNGBDBM476630(N-(4-(2-hexylhydrazine-1- carbonyl)benzyl)cinnamam...)
Affinity DataIC50:  139nM. Assay description: Recombinant HDACs 1, 2, and 3 (BPS Biosciences) were diluted to a concentration of 1 nM in HDAC buffer. 10 uL of this solution was added in 96-well f...
Ligand InfoPC cidPC sid
In DepthDetails US Patent
TargetHistone deacetylase 3(Homo sapiens (Human))
Musc Foundation For Research Development
US Patent
LigandPNGBDBM476630(N-(4-(2-hexylhydrazine-1- carbonyl)benzyl)cinnamam...)
Affinity DataIC50:  150nM. Assay description: Recombinant HDACs 1, 2, and 3 (BPS Biosciences) were diluted to a concentration of 1 nM in HDAC buffer. 10 uL of this solution was added in 96-well f...
Ligand InfoPC cidPC sid
In DepthDetails US Patent
TargetHistone deacetylase 2(Homo sapiens (Human))
Musc Foundation For Research Development
US Patent
LigandPNGBDBM476630(N-(4-(2-hexylhydrazine-1- carbonyl)benzyl)cinnamam...)
Affinity DataIC50:  139nM. Assay description: Inhibition of C-terminal His-tagged recombinant human HDAC2 expressed in Sf9 cells pre-incubated for 2 hrs before acetylated lysine-aminomethyl couma...
Ligand InfoPC cidPC sid
In DepthDetails ArticlePubMed
TargetHistone deacetylase 3(Homo sapiens (Human))
Musc Foundation For Research Development
US Patent
LigandPNGBDBM476630(N-(4-(2-hexylhydrazine-1- carbonyl)benzyl)cinnamam...)
Affinity DataIC50:  1.72E+3nM. Assay description: Allosteric inhibition of HDAC3 in HEK293 cell lysates pre-incubated for 2 hrs before acetylated lysine-aminomethyl coumarin-BOC addition and measured...
Ligand InfoPC cidPC sid
In DepthDetails ArticlePubMed
TargetHistone deacetylase 1(Homo sapiens (Human))
Musc Foundation For Research Development
US Patent
LigandPNGBDBM476630(N-(4-(2-hexylhydrazine-1- carbonyl)benzyl)cinnamam...)
Affinity DataIC50:  81nM. Assay description: Inhibition of C-terminal His-tagged recombinant human HDAC1 expressed in Sf9 cells pre-incubated for 2 hrs before acetylated lysine-aminomethyl couma...
Ligand InfoPC cidPC sid
In DepthDetails ArticlePubMed
TargetHistone deacetylase 3(Homo sapiens (Human))
Musc Foundation For Research Development
US Patent
LigandPNGBDBM476630(N-(4-(2-hexylhydrazine-1- carbonyl)benzyl)cinnamam...)
Affinity DataIC50:  150nM. Assay description: Allosteric inhibition of C-terminal His-tagged recombinant human HDAC3 expressed in Sf9 cells pre-incubated for 2 hrs before acetylated lysine-aminom...
Ligand InfoPC cidPC sid
In DepthDetails ArticlePubMed