BDBM477265 US10889546, US2007/0299086 Table 2.2::US10889546, US2007/0299086 Table 2.5
SMILES CCc1ccc(cc1)-c1cnc(C(=O)NCC(O)=O)c(O)c1
InChI Key InChIKey=NNAZIWWVSJICRG-UHFFFAOYSA-N
Data  2 IC50
  Tab Delimited (TSV)   2D SDfile   Computed 3D by Vconf -m prep SDfile
Find this compound or compounds like it in BindingDB:
Activity Spreadsheet -- Enzyme Inhibition Constant Data from BindingDB
Found 2 hits for monomerid = 477265
TargetEgl nine homolog 1(Homo sapiens (Human))
Jiangsu Hengrui Medicine
US Patent
LigandPNGBDBM477265(US10889546, US2007/0299086 Table 2.2 | US10889546,...)
Affinity DataIC50:  1.50E+3nM. Assay description: The EGLN-1 (or EGLN-3) enzyme activity is determined using mass spectrometry (matrix-assisted laser desorption ionization, time-of-flight MS, MALD...
Ligand InfoPC cidPC sid
In DepthDetails US Patent
TargetEgl nine homolog 1(Homo sapiens (Human))
Jiangsu Hengrui Medicine
US Patent
LigandPNGBDBM477265(US10889546, US2007/0299086 Table 2.2 | US10889546,...)
Affinity DataIC50:  1.50E+3nM. Assay description: The EGLN-1 (or EGLN-3) enzyme activity is determined using mass spectrometry (matrix-assisted laser desorption ionization, time-of-flight MS, MALD...
Ligand InfoPC cidPC sid
In DepthDetails US Patent