BDBM477923 (1S,5S,6S)-3-amino-5-(5-((5-cyano-3-methylpyridin-2-yl)ethynyl)-2-fluorophenyl)-5-methyl-2-thia-4-azabicyclo[4.1.0]hept-3-ene-1-carbonitrile::US10889581, Example 126
SMILES Cc1cc(cnc1C#Cc1ccc(F)c(c1)[C@@]1(C)N=C(N)S[C@]2(C[C@@H]12)C#N)C#N
InChI Key InChIKey=CBYOFAWUWAYPKP-KSEOMHKRSA-N
Data  3 IC50
  Tab Delimited (TSV)   2D SDfile   Computed 3D by Vconf -m prep SDfile
Find this compound or compounds like it in BindingDB:
Activity Spreadsheet -- Enzyme Inhibition Constant Data from BindingDB
Found 3 hits for monomerid = 477923
TargetBeta-secretase 1(Homo sapiens (Human))
Amgen
US Patent
LigandPNGBDBM477923((1S,5S,6S)-3-amino-5-(5-((5-cyano-3-methylpyridin-...)
Affinity DataIC50:  21nM. Assay description: The cDNAs for both human recombinant BACE1 and 2 with C-terminal 6-His Tags were cloned into transient protein expression vectors, which were subsequ...
Ligand InfoPC cidPC sid
In DepthDetails US Patent
TargetCathepsin D(Homo sapiens (Human))
Amgen
US Patent
LigandPNGBDBM477923((1S,5S,6S)-3-amino-5-(5-((5-cyano-3-methylpyridin-...)
Affinity DataIC50:  2.68E+5nM. Assay description: Recombinant CatD was expressed in CHO cells. The assay buffer for CatD was 0.05 M citrate pH 3.5, 10% DMSO final, 5 mM CHAPS. The CatD enzyme (9 nM) ...
Ligand InfoPC cidPC sid
In DepthDetails US Patent
TargetBeta-secretase 2(Homo sapiens (Human))
Amgen
US Patent
LigandPNGBDBM477923((1S,5S,6S)-3-amino-5-(5-((5-cyano-3-methylpyridin-...)
Affinity DataIC50:  617nM. Assay description: The cDNAs for both human recombinant BACE1 and 2 with C-terminal 6-His Tags were cloned into transient protein expression vectors, which were subsequ...
Ligand InfoPC cidPC sid
In DepthDetails US Patent