BDBM481077 US10906890, Example 89.0
SMILES CO[C@@H]([C@H](C)S(=O)(=O)Nc1nnc(-c2cccc(OC(F)(F)F)c2)n1-c1c(OC)cccc1OC)c1ncc(C)cn1
InChI Key InChIKey=HWABDDHGVNCUTQ-AOMKIAJQSA-N
Data  1 EC50
  Tab Delimited (TSV)   2D SDfile   Computed 3D by Vconf -m prep SDfile
Find this compound or compounds like it in BindingDB:
Activity Spreadsheet -- Enzyme Inhibition Constant Data from BindingDB
Found 1 hit for monomerid = 481077
TargetApelin receptor(Homo sapiens (Human))
Amgen
US Patent
LigandPNGBDBM481077(US10906890, Example 89.0)
Affinity DataEC50:  0.470nM. Assay description: The human APJ receptor was cloned by polymerase chain reaction and the gene encoding the receptor was subcloned in pFLAG-CMV™-3 expression vector (Si...
Ligand InfoPC cidPC sid
In DepthDetails US Patent