BDBM485794 (S)-N-ethyl-3-(isoquinolin- 5-yloxy)-3-(thiophen-2- yl)propan-1-amine::US10941138, Example 92
SMILES CCNCC[C@H](Oc1cccc2cnccc12)c1cccs1
InChI Key InChIKey=AJMKPXNBSXISRO-KRWDZBQOSA-N
Data  1 KI
  Tab Delimited (TSV)   2D SDfile   Computed 3D by Vconf -m prep SDfile
Find this compound or compounds like it in BindingDB:
Activity Spreadsheet -- Enzyme Inhibition Constant Data from BindingDB
Found 1 hit for monomerid = 485794
TargetVoltage-dependent calcium channel subunit alpha-2/delta-1(Homo sapiens (Human))
Esteve Pharmaceuticals
US Patent
LigandPNGBDBM485794((S)-N-ethyl-3-(isoquinolin- 5-yloxy)-3-(thiophen-2...)
Affinity DataKi: >3.00E+3nM. Assay description: Human α2δ-1 enriched membranes (2.5 μg) were incubated with 15 nM of radiolabeled [3H]-Gabapentin in assay buffer containing Hepes-KOH...
Ligand InfoPC cidPC sid
In DepthDetails US Patent