BDBM49108 6-ethylindolo[3,2-b]quinoxaline::MLS000105674::SMR000102652::cid_746478
SMILES CCn1c2ccccc2c2nc3ccccc3nc12
InChI Key InChIKey=IQAPAXYJGPZPMU-UHFFFAOYSA-N
Data  2 IC50  1 EC50
  Tab Delimited (TSV)   2D SDfile   Computed 3D by Vconf -m prep SDfile
Find this compound or compounds like it in BindingDB:
Activity Spreadsheet -- Enzyme Inhibition Constant Data from BindingDB
Found 3 hits for monomerid = 49108
TargetD(1A) dopamine receptor(Homo sapiens (Human))
Vanderbilt Screening Center For Gpcrs, Ion Channels and Transporters
Curated by PubChem BioAssay
LigandPNGBDBM49108(6-ethylindolo[3,2-b]quinoxaline | MLS000105674 | S...)
Affinity DataEC50:  0.0112nM. Assay description: Assay Provider: Val Watts Assay Provider Affiliation: Purdue University Grant Title: Allosteric Modulators of D1 Receptors Grant Number: 1 X01 MH0776...
In DepthDetails PCBioAssay
TargetOrexin/Hypocretin receptor type 1(Homo sapiens (Human))
The Scripps Research Institute Molecular Screening Center
Curated by PubChem BioAssay
LigandPNGBDBM49108(6-ethylindolo[3,2-b]quinoxaline | MLS000105674 | S...)
Affinity DataIC50:  914nM. Assay description: Source (MLPCN Center Name): The Scripps Research Institute Molecular Screening Center (SRIMSC) Affiliation: The Scripps Research Institute, TSRI Assa...
In DepthDetails PCBioAssay
TargetOrexin/Hypocretin receptor type 1(Homo sapiens (Human))
The Scripps Research Institute Molecular Screening Center
Curated by PubChem BioAssay
LigandPNGBDBM49108(6-ethylindolo[3,2-b]quinoxaline | MLS000105674 | S...)
Affinity DataIC50:  6.20E+3nM. Assay description: Source (MLPCN Center Name): The Scripps Research Institute Molecular Screening Center (SRIMSC) Affiliation: The Scripps Research Institute, TSRI Assa...
In DepthDetails PCBioAssay