BDBM50021260 CHEMBL3287907
SMILES COc1nc2cccnc2n1[C@H]1C[C@@H](C1)Nc1nc2ccccc2s1
InChI Key InChIKey=QSZCDYHTHAAFAW-HAQNSBGRSA-N
Data  1 IC50
PDB links: 1 PDB ID matches this monomer.
  Tab Delimited (TSV)   2D SDfile   Computed 3D by Vconf -m prep SDfile
Find this compound or compounds like it in BindingDB:
Activity Spreadsheet -- Enzyme Inhibition Constant Data from BindingDB
Found 1 hit for monomerid = 50021260
LigandPNGBDBM50021260(CHEMBL3287907)
Affinity DataIC50:  0.800nM. Assay description: Inhibition of human recombinant PDE10A using cAMP as substrate after 1 hr by IMAP-FRET assay