BDBM50021289 CHEMBL3287922
SMILES Cc1ccc(cc1C)-c1nc(C)c([C@H](OC(C)(C)C)C(O)=O)c(c1C)-c1ccc2OCCCc2c1C
InChI Key InChIKey=BRICMASRSZMVBP-LJAQVGFWSA-N
Data  1 Kd
  Tab Delimited (TSV)   2D SDfile   Computed 3D by Vconf -m prep SDfile
Find this compound or compounds like it in BindingDB:
Activity Spreadsheet -- Enzyme Inhibition Constant Data from BindingDB
Found 1 hit for monomerid = 50021289
TargetIntegrase(Human immunodeficiency virus 1)
Boehringer Ingelheim (Canada)
Curated by ChEMBL
LigandPNGBDBM50021289(CHEMBL3287922)
Affinity DataKd:  26nM. Assay description: Apparent binding affinity to Trx-His-tagged HIV integrase
In DepthDetails ArticlePubMed