BDBM50025173 CHEMBL3337881
SMILES COc1cccc(CNC(=O)c2nc3sccc3c(=O)[nH]2)c1
InChI Key InChIKey=JBLVGKQIAQNLEM-UHFFFAOYSA-N
Data  1 IC50
PDB links: 1 PDB ID matches this monomer.
  Tab Delimited (TSV)   2D SDfile   Computed 3D by Vconf -m prep SDfile
Find this compound or compounds like it in BindingDB:
Activity Spreadsheet -- Enzyme Inhibition Constant Data from BindingDB
Found 1 hit for monomerid = 50025173
TargetCollagenase 3(Homo sapiens (Human))
Takeda Pharmaceutical
Curated by ChEMBL
LigandPNGBDBM50025173(CHEMBL3337881)
Affinity DataIC50:  24nM. Assay description: Inhibition of human recombinant MMP13 catalytic domain using fluorescence peptide Cy3-PLGLK(Cy5Q)AR-NH2 substrate by fluorescence assay