BDBM50030938 CHEMBL2335381
SMILES Cc1cc2n(C)c(=O)n(C)c2cc1N
InChI Key InChIKey=DHPXTEFKFUCWDK-UHFFFAOYSA-N
Data  1 Kd
PDB links: 1 PDB ID matches this monomer.
  Tab Delimited (TSV)   2D SDfile   Computed 3D by Vconf -m prep SDfile
Find this compound or compounds like it in BindingDB:
Activity Spreadsheet -- Enzyme Inhibition Constant Data from BindingDB
Found 1 hit for monomerid = 50030938
TargetATPase family AAA domain-containing protein 2(Homo sapiens (Human))
Vanderbilt University School Of Medicine
Curated by ChEMBL
LigandPNGBDBM50030938(CHEMBL2335381)
Affinity DataKd:  6.00E+5nM. Assay description: Binding affinity to human ATAD2 (979 to 1108 aa) expressed in Escherichia coli BL21 (DE3) by SOFAST-HMQC NMR spectroscopy