BDBM50036582 CHEMBL3354255
SMILES CN1C(=N)N[C@](CCC2CCCCC2)(C[C@H]2CCC[C@H](C2)NC(=O)Nc2ccccc2)C1=O
InChI Key InChIKey=CVMRAJSOLFSMNH-UNIVCBNLSA-N
Data  2 KI
PDB links: 1 PDB ID matches this monomer.
  Tab Delimited (TSV)   2D SDfile   Computed 3D by Vconf -m prep SDfile
Find this compound or compounds like it in BindingDB:
Activity Spreadsheet -- Enzyme Inhibition Constant Data from BindingDB
Found 2 hits for monomerid = 50036582
TargetBeta-secretase 1(Homo sapiens (Human))
Merck Research Laboratories
Curated by ChEMBL
LigandPNGBDBM50036582(CHEMBL3354255)
Affinity DataKi:  16nM. Assay description: Inhibition of purified human BACE1 by FRET assay
TargetCathepsin D(Homo sapiens (Human))
Merck Research Laboratories
Curated by ChEMBL
LigandPNGBDBM50036582(CHEMBL3354255)
Affinity DataKi:  7.10E+3nM. Assay description: Inhibition of cathepsin-D (unknown origin)
In DepthDetails ArticlePubMed