BDBM50056266 CHEMBL3322308
SMILES OC[C@H]1O[C@@H](NC(=O)NC(=O)c2ccccn2)[C@H](O)[C@@H](O)[C@@H]1O
InChI Key InChIKey=CGKGUAIYBUNWNI-WSOSLHDDSA-N
Data  1 KI
PDB links: 1 PDB ID matches this monomer.
  Tab Delimited (TSV)   2D SDfile   Computed 3D by Vconf -m prep SDfile
Find this compound or compounds like it in BindingDB:
Activity Spreadsheet -- Enzyme Inhibition Constant Data from BindingDB
Found 1 hit for monomerid = 50056266
TargetGlycogen phosphorylase, muscle form(Oryctolagus cuniculus (rabbit))
University Of Thessaly
Curated by ChEMBL
LigandPNGBDBM50056266(CHEMBL3322308)
Affinity DataKi:  6.80E+4nM. Assay description: Inhibition of rabbit skeletal muscle glycogen phosphorylase b assessed as inorganic phosphate release