BDBM50056537 CHEMBL159475::[3-(3-Nitro-benzyl)-2,4,6-trioxo-tetrahydro-pyrimidin-1-yl]-acetic acid
SMILES OC(=O)Cn1c(=O)cc(O)n(Cc2cccc(c2)[N+]([O-])=O)c1=O
InChI Key InChIKey=FHNOCJKWYJJEJT-UHFFFAOYSA-N
Data  1 IC50
  Tab Delimited (TSV)   2D SDfile   Computed 3D by Vconf -m prep SDfile
Find this compound or compounds like it in BindingDB:
Activity Spreadsheet -- Enzyme Inhibition Constant Data from BindingDB
Found 1 hit for monomerid = 50056537
TargetAldo-keto reductase family 1 member A1(Rattus norvegicus)
Nippon Zoki Pharmaceutical
Curated by ChEMBL
LigandPNGBDBM50056537(CHEMBL159475 | [3-(3-Nitro-benzyl)-2,4,6-trioxo-te...)
Affinity DataIC50: >1.00E+5nM. Assay description: In vitro inhibitory activity against rat kidney aldehyde reductase(ALR).
In DepthDetails ArticlePubMed