BDBM50078188 CHEMBL3417753
SMILES CN(C)Cc1ccc(Oc2ccc(cc2)S(=O)(=O)C2(CCC3(C2)CCNCC3)C(=O)NO)cc1
InChI Key InChIKey=CPHDTZDAGOQCET-UHFFFAOYSA-N
Data  2 IC50
  Tab Delimited (TSV)   2D SDfile   Computed 3D by Vconf -m prep SDfile
Find this compound or compounds like it in BindingDB:
Activity Spreadsheet -- Enzyme Inhibition Constant Data from BindingDB
Found 2 hits for monomerid = 50078188
TargetStromelysin-2(Homo sapiens (Human))
University Of Navarra
Curated by ChEMBL
LigandPNGBDBM50078188(CHEMBL3417753)
Affinity DataIC50:  7.81E+3nM. Assay description: Inhibition of MMP-10 (unknown origin) measured every minute for 1 hr by fluorescence assay
In DepthDetails ArticlePubMed
TargetStromelysin-1(Homo sapiens (Human))
University Of Navarra
Curated by ChEMBL
LigandPNGBDBM50078188(CHEMBL3417753)
Affinity DataIC50:  7.27E+3nM. Assay description: Inhibition of MMP-3 (unknown origin) measured every minute for 1 hr by fluorescence assay
In DepthDetails ArticlePubMed